{"text_format":"3","workbook":"xlsx","n_sheets":3,"sheets":["入力","発注シート（送付用）","休業日"],"not_rendered":{"images":1,"defined_names":5},"read":"whole","date_system":"1900"}

{"sheet":"入力","index":0,"n_rows":330,"n_cols":19,"rows_kept":330,"merged":[[0,0,0,4],[0,6,0,8],[1,0,1,4],[1,6,1,7],[2,0,2,4],[2,6,2,8]]}
["①の『品目』を選択、②の『分類』を選択、③右側の注文数欄（黄色部）に入力して、",{"$nulls":5},{"$f":"IF(休業日!A314=0,\"\",\"*印の資材は取寄せ品（再リース）にて、納期等は別途でご連絡させて頂きます。\")","v":"*印の資材は取寄せ品（再リース）にて、納期等は別途でご連絡させて頂きます。"}]
["別シート『発注シート(送付用)』に現場名等の必要事項を追記して、ご注文をお願いします。",{"$nulls":5},"資材重量",null,{"$f":"休業日!T1","v":{"v":0,"d":"0.0㌧"}}]
["新たな資材の入力をする場合は　　　　をクリックして選択を解除してください。",{"$nulls":5},"記載が無い資材につきましてはお手数ですが別途お問い合わせをお願いします。",{"$nulls":8},"配 達 希 望","増ｔユニック(積載9ｔ)"]
[{"$nulls":6},"機材名","サイズ等","注文数",null,"①『品目』を選択","②『分類』を選択後　　③右の注文数を入力","コード","重量","土のう袋","自 社 便 引 取","増ｔ平車(積載10ｔ)"]
[{"$nulls":6},"Ｉｑ支柱３８００","H3800 φ48.6",null,{"v":50,"d":"結束数：50"},"　Iｑシステム","Iq支柱","IQA3800",{"v":11.7,"d":"11.70"},null,null,"4ｔユニック(積載2.4ｔ)",{"$f":"IF(G5=\"\",\"\",COUNTA(G$5:G5))","v":1},{"$f":"IF(I5>0,ROW(),\"\")","v":""}]
[{"$nulls":6},"Ｉｑ支柱１９００【青】","H1900 φ48.6",null,{"v":50,"d":"結束数：50"},"　Iｑシステム","Iq支柱","IQA1900",{"v":6.2,"d":"6.20"},{"$nulls":4},{"$f":"IF(I6>0,ROW(),\"\")","v":""}]
[{"$nulls":6},"Ｉｑ支柱１４２５【黄】","H1425 φ48.6",null,{"v":50,"d":"結束数：50"},"　Iｑシステム","Iq支柱","IQA1425",{"v":4.8,"d":"4.80"},{"$nulls":3},100,""]
[{"$nulls":6},"Ｉｑ支柱９５０【ピンク】","H950 φ48.6",null,{"v":50,"d":"結束数：50"},"　Iｑシステム","Iq支柱","IQA950",{"v":3.4,"d":"3.40"},{"$nulls":3},200,""]
[{"$nulls":6},"Ｉｑ支柱４７５【黄緑】","H475 φ48.6",null,{"v":50,"d":"結束数：50"},"　Iｑシステム","Iq支柱","IQA475",{"v":2.1,"d":"2.10"},{"$nulls":3},300,""]
[{"$nulls":6},"Ｉｑ下部支柱２７５０Ａ　","最下段用 H2750",null,{"v":50,"d":"結束数：50"},"　Iｑシステム","Iq支柱","IQA2750A",{"v":8.8,"d":"8.80"},{"$nulls":3},400,""]
[{"$nulls":6},"Ｉｑ下部支柱１４２５Ａ【スカイブルー】","最下段用 H1425",null,{"v":50,"d":"結束数：50"},"　Iｑシステム","Iq支柱","IQA1425A",{"v":4.9,"d":"4.90"},{"$nulls":3},500,""]
[{"$nulls":6},"Ｉｑ下部支柱９５０Ａ　【オレンジ】","最下段用 H950",null,{"v":50,"d":"結束数：50"},"　Iｑシステム","Iq支柱","IQA950A",{"v":3.4,"d":"3.40"},{"$nulls":3},600,""]
[{"$nulls":6},"Ｉｑ下部支柱４７５Ａ【緑】　","最下段用 H475",null,{"v":50,"d":"結束数：50"},"　Iｑシステム","Iq支柱","IQA475A",{"v":2.1,"d":"2.10"},{"$nulls":3},700,""]
[{"$nulls":6},"Ｉｑ下部支柱２３８Ａ　","最下段用 H238",null,{"v":100,"d":"結束数：100"},"　Iｑシステム","Iq支柱","IQA238A",{"v":1.4,"d":"1.40"},{"$nulls":3},800,""]
[{"$nulls":6},"Ｉｑヘッド支柱９５０【黒】","ステージ用　Ｈ950",null,{"v":50,"d":"結束数：50"},"　Iｑシステム","Iq支柱","IQA950H",{"v":3,"d":"3.00"},{"$nulls":3},900,""]
[{"$nulls":6},"Ｉｑヘッド支柱６００【紫】","支保工用　Ｈ600",null,{"v":50,"d":"結束数：50"},"　Iｑシステム","Iq支柱","IQA600H",{"v":1.8,"d":"1.80"},{"$nulls":3},1000,""]
[{"$nulls":6},"Ｉｑ手すり１８２９","L1829　φ42.7",null,{"v":50,"d":"結束数：50"},"　Iｑシステム","Iq手すり","IQC1829",{"v":4.4,"d":"4.40"},{"$nulls":3},50,""]
[{"$nulls":6},"Ｉｑ手すり１５２４【黄】","L1524　φ42.7",null,{"v":50,"d":"結束数：50"},"　Iｑシステム","Iq手すり","IQC1524",{"v":3.7,"d":"3.70"},{"$nulls":3},100,""]
[{"$nulls":6},"Ｉｑ手すり１２１９【青】","L・W1219　φ42.7",null,{"v":50,"d":"結束数：50"},"　Iｑシステム","Iq手すり","IQC1219",{"v":3,"d":"3.00"},{"$nulls":3},150,""]
[{"$nulls":6},"Ｉｑ手すり１１０７【黄緑】","梁専用 W1107　φ42.7",null,{"v":50,"d":"結束数：50"},"　Iｑシステム","Iq手すり","IQC1107",{"v":2.8,"d":"2.80"},{"$nulls":3},200]
[{"$nulls":6},"Ｉｑ手すり９１４【ピンク】","L・W914　φ42.7",null,{"v":50,"d":"結束数：50"},"　Iｑシステム","Iq手すり","IQC914",{"v":2.3,"d":"2.30"},{"$nulls":3},250]
[{"$nulls":6},"Ｉｑ手すり７２２【ムラサキ】","※コーナー調整専用（1.829-1.107）",null,{"v":50,"d":"結束数：50"},"　Iｑシステム","Iq手すり","IQC722",{"v":2,"d":"2.00"},{"$nulls":3},300]
[{"$nulls":6},"Ｉｑ手すり６１０","L・W610　φ42.7",null,{"v":50,"d":"結束数：50"},"　Iｑシステム","Iq手すり","IQC610",{"v":1.6,"d":"1.60"},{"$nulls":3},350]
[{"$nulls":6},"Ｉｑ手すり３６０【オレンジ】","L360　φ42.7",null,{"v":20,"d":"梱包数：20"},"　Iｑシステム","Iq手すり","IQC360",{"v":1,"d":"1.00"},20,null,null,400]
[{"$nulls":6},"Ｉｑ手すり３０５","L305　φ42.7",null,{"v":20,"d":"梱包数：20"},"　Iｑシステム","Iq手すり","IQC305",{"v":0.9,"d":"0.90"},20,null,null,450]
[{"$nulls":6},"Ｉｑ手すり２５０【黒】","L250　φ42.7",null,{"v":20,"d":"梱包数：20"},"　Iｑシステム","Iq手すり","IQC250",{"v":0.8,"d":"0.80"},20,null,null,500]
[{"$nulls":6},"Ｉｑ【先行】手すり１８２９","L1829　φ27.2",null,{"v":50,"d":"結束数：50"},"　Iｑシステム","Iq先行手すり","IQSCX18",{"v":7.2,"d":"7.20"},{"$nulls":3},200]
[{"$nulls":6},"Ｉｑ【先行】手すり１５２４【黄】","L1524　φ27.2",null,{"v":50,"d":"結束数：50"},"　Iｑシステム","Iq先行手すり","IQSCX15",{"v":6.3,"d":"6.30"},{"$nulls":3},400]
[{"$nulls":6},"Ｉｑ【先行】手すり１２１９【青】","L1219　φ27.2",null,{"v":50,"d":"結束数：50"},"　Iｑシステム","Iq先行手すり","IQSCX12",{"v":5.5,"d":"5.50"},{"$nulls":3},600]
["*印の資材は取寄せ品にて、納期等は確認後にご連絡させて頂きます。",{"$nulls":5},"Ｉｑ【先行】手すり９１４【ピンク】","L914　φ27.2",null,{"v":50,"d":"結束数：50"},"　Iｑシステム","Iq先行手すり","IQSCX09",{"v":4.7,"d":"4.70"},{"$nulls":3},800]
[{"$nulls":6},"Ｉｑ【先行】手すり６１０【黄緑】","L610　φ27.2",null,{"v":50,"d":"結束数：50"},"　Iｑシステム","Iq先行手すり","IQSCX06",{"v":4,"d":"4.00"},{"$nulls":3},1000]
[{"$nulls":6},"Ｉｑアルミカイダン１９","7段　W481　L2471",null,{"v":10,"d":"結束数：10"},"　Iｑシステム","Iqカイダン類","IQKD19",{"v":13.5,"d":"13.50"},{"$nulls":3},4]
[{"$nulls":6},"Ｉｑカイダンレール　斜め手すり ","2段目以上用　(1ヵ所あたり2本使用）L2445　",null,{"v":10,"d":"結束数：10"},"　Iｑシステム","Iqカイダン類","IQKDR",{"v":3.6,"d":"3.60"},{"$nulls":3},8]
[{"$nulls":6},"Ｉｑアイテスリ　階段開口部用手すり","H1000　L1829",null,{"v":10,"d":"結束数：10"},"　Iｑシステム","Iqカイダン類","IQKKTG",{"v":15,"d":"15.00"},{"$nulls":3},12]
[{"$nulls":6},"ＳＰカイダン手摺　斜め手すり","最下段用　二段一体式",null,{"v":10,"d":"結束数：10"},"　Iｑシステム","Iqカイダン類","VKTSP",{"v":4.2,"d":"4.20"},{"$nulls":3},16]
[{"$nulls":6},"Ｉｑ張出ブラケット６１０","L610　H243",null,{"v":20,"d":"結束数：20"},"　Iｑシステム","Iqブラケット","IQBH610",{"v":2.9,"d":"2.90"},{"$nulls":3},2]
[{"$nulls":6},"Ｉｑ張出ブラケット３６０","L360　H240",null,{"v":20,"d":"結束数：20"},"　Iｑシステム","Iqブラケット","IQBH360",{"v":2.2,"d":"2.20"},{"$nulls":3},4]
[{"$nulls":6},"Ｉｑブラケット６１０","L610　H263",null,{"v":20,"d":"結束数：20"},"　Iｑシステム","Iqブラケット","IQB610",{"v":2.4,"d":"2.40"},{"$nulls":3},6]
[{"$nulls":6},"Ｉｑブラケット３６０","L360　H244",null,{"v":20,"d":"結束数：20"},"　Iｑシステム","Iqブラケット","IQB360",{"v":1.6,"d":"1.60"},{"$nulls":3},8]
[{"$nulls":6},"Ｉｑ伸縮ブラケット７１","L770～1065　H446",null,{"v":20,"d":"結束数：20"},"　Iｑシステム","Iqブラケット","IQBS71",{"v":7.2,"d":"7.20"},{"$nulls":3},10]
[{"$nulls":6},"Ｉｑ伸縮ブラケット５７","L505～799　H446",null,{"v":20,"d":"結束数：20"},"　Iｑシステム","Iqブラケット","IQBS57",{"v":6.2,"d":"6.20"},{"$nulls":3},12]
[{"$nulls":6},"Ｉｑ伸縮ブラケット３５","L355～570　H379",null,{"v":20,"d":"結束数：20"},"　Iｑシステム","Iqブラケット","IQBS35",{"v":3.6,"d":"3.60"},{"$nulls":3},14]
[{"$nulls":6},"Ｉｑ伸縮ブラケット先端C","φ48.6用",null,{"v":30,"d":"梱包数：30"},"　Iｑシステム","Iqブラケット","IQBSC",{"v":1,"d":"1.00"},30,null,null,16]
[{"$nulls":6},"Ｉｑ拡幅挟幅アタッチメント３０５","L1357",null,null,"　Iｑシステム","Iq拡幅狭幅部材・フレーム補強材","IQBHKA",{"v":3.8,"d":"3.80"},{"$nulls":3},18]
[{"$nulls":6},"Ｉｑ拡幅挟幅ブラケット３０５","W610⇐914⇒1219拡幅挟幅用　L305　H185",{"$f":"I44","v":{"v":0,"d":"0 "}},"セット品","　Iｑシステム","Iq拡幅狭幅部材・フレーム補強材","IQBHK305",{"v":2.3,"d":"2.30"},{"$nulls":3},20]
[{"$nulls":6},"Ｉｑ拡幅挟幅アタッチメント４９７","L1450",null,null,"　Iｑシステム","Iq拡幅狭幅部材・フレーム補強材","IQBHKB",{"v":4.1,"d":"4.10"}]
[{"$nulls":6},"Ｉｑ拡幅挟幅ブラケット４９７","W1107⇒610挟幅用　L497　H185　",{"$f":"I46","v":{"v":0,"d":"0 "}},"セット品","　Iｑシステム","Iq拡幅狭幅部材・フレーム補強材","IQBHK497",{"v":2.6,"d":"2.60"}]
[{"$nulls":6},"Ｉｑフレーム補強材１２１９","W1219用",null,{"v":10,"d":"結束数：10"},"　Iｑシステム","Iq拡幅狭幅部材・フレーム補強材","IQFH1219",{"v":6.6,"d":"6.60"}]
[{"$nulls":6},"Ｉｑフレーム補強材１１０７","W1107用",null,{"v":10,"d":"結束数：10"},"　Iｑシステム","Iq拡幅狭幅部材・フレーム補強材","IQFH1107",{"v":6.4,"d":"6.40"}]
[{"$nulls":6},"Ｉｑフレーム補強材９１４","W914用",null,{"v":10,"d":"結束数：10"},"　Iｑシステム","Iq拡幅狭幅部材・フレーム補強材","IQFH914",{"v":6.1,"d":"6.10"}]
[{"$nulls":6},"Ｉｑフレーム補強材６１０","W610用",null,{"v":10,"d":"結束数：10"},"　Iｑシステム","Iq拡幅狭幅部材・フレーム補強材","IQFH610",{"v":5.1,"d":"5.10"}]
[{"$nulls":6},"Ｉｑ梁枠１．５スパン ","L2743　(1.829+0.914)",null,"1セット：2","　Iｑシステム","Iq用　梁枠・その他部材","IQG1.5",{"v":16,"d":"16.00"}]
[{"$nulls":6},"Ｉｑ梁枠２スパン","L3658",null,"1セット：2","　Iｑシステム","Iq用　梁枠・その他部材","IQG2",{"v":21.2,"d":"21.20"}]
[{"$nulls":6},"Ｉｑ梁枠３スパン","L5487",null,"1セット：2","　Iｑシステム","Iq用　梁枠・その他部材","IQG3",{"v":35.5,"d":"35.50"}]
[{"$nulls":6},"Ｉｑ梁枠４スパン差込側　※1セット:差込2＋受け2","L3634　H475　",null,"1セット：2","　Iｑシステム","Iq用　梁枠・その他部材","IQN4S",{"v":29.5,"d":"29.50"}]
[{"$nulls":6},"Ｉｑ梁枠４スパン受け側　","L3634　H475",{"$f":"I55","v":{"v":0,"d":"0 "}},null,"　Iｑシステム","Iq用　梁枠・その他部材","IQG4U",{"v":28.9,"d":"28.90"}]
[{"$nulls":6},"Ｉｑ梁枠４スパン梁受金具","4スパン1セットに6個使用",{"$f":"I55*3","v":{"v":0,"d":"0 "}},{"v":6,"d":"梱包数：6"},"　Iｑシステム","Iq用　梁枠・その他部材","IQG4GSWK",{"v":1.1,"d":"1.10"},6]
[{"$nulls":6},"Ｉｑ荷受ステージ　(許容支持力：750㎏)","W1829　D1524",null,null,"　Iｑシステム","Iq用　梁枠・その他部材","IQNS",{"v":14.7,"d":"14.70"}]
[{"$nulls":6},"Ｉｑ大筋交クランプ","L150",null,{"v":10,"d":"梱包数：10"},"　Iｑシステム","Iq用　梁枠・その他部材","IQRC",{"v":1,"d":"1.00"},10]
[{"$nulls":6},"Ｉｑ吊り治具　（Iqフランジ専用）","4点吊り＝1セット：4個使用",null,"1セット：4","　Iｑシステム","Iq用　梁枠・その他部材","IQTG",{"v":1.2,"d":"1.20"},4]
[{"$nulls":6},"Ｉｑ吊り治具シャックル","※治具とセットで使用　φ16（SC16）",{"$f":"I60","v":{"v":0,"d":"0 "}},"セット品","　Iｑシステム","Iq用　梁枠・その他部材","IQTS",{"v":0.6,"d":"0.60"}]
[{"$nulls":6},"Ｉｑ支柱結束枠 （2枠で1セット）","W704　H354",null,"1セット：2","　Iｑシステム","Iq用　梁枠・その他部材","IQAKW",{"v":5.1,"d":"5.10"}]
[{"$nulls":6},"Ｉｑローリングタワー　３段仕様","作業床高：約2.51ｍ　床：1829×1219",null,null,"　Iｑシステム","ローリングタワー","IQRT3",{"v":274.1,"d":"274.10"}]
[{"$nulls":6},"Ｉｑローリングタワー　4段仕様","作業床高：約4.41ｍ　床：1829×1219",null,null,"　Iｑシステム","ローリングタワー","IQRT4",{"v":378.9,"d":"378.90"}]
[{"$nulls":6},"Ｉｑローリングタワー　５段仕様","作業床高：約6.31ｍ　床：1829×1219",null,null,"　Iｑシステム","ローリングタワー","IQRT5",{"v":483.7,"d":"483.70"}]
[{"$nulls":6},"Ｓウォーク　Ｎ６","W490  L1829",null,{"v":20,"d":"結束数：20"},"　布板・コーナーステップ","Ｓウォーク","ACN6",{"v":15.9,"d":"15.90"}]
[{"$nulls":6},"Ｓウォーク　６２４","W240  L1829",null,{"v":20,"d":"結束数：20"},"　布板・コーナーステップ","Ｓウォーク","ACN624",{"v":8.9,"d":"8.90"}]
[{"$nulls":6},"Ｓウォーク　Ｎ５【黄】","W490  L1524",null,{"v":20,"d":"結束数：20"},"　布板・コーナーステップ","Ｓウォーク","ACN5",{"v":13.9,"d":"13.90"}]
[{"$nulls":6},"Ｓウォーク　５２４【黄】","W240  L1524",null,{"v":20,"d":"結束数：20"},"　布板・コーナーステップ","Ｓウォーク","ACN524",{"v":8,"d":"8.00"}]
[{"$nulls":6},"Ｓウォーク　Ｎ４【青】","W490  L1219",null,{"v":20,"d":"結束数：20"},"　布板・コーナーステップ","Ｓウォーク","ACN4",{"v":11.7,"d":"11.70"}]
[{"$nulls":6},"Ｓウォーク　４２４【青】","W240  L1219",null,{"v":20,"d":"結束数：20"},"　布板・コーナーステップ","Ｓウォーク","ACN424",{"v":6.9,"d":"6.90"}]
[{"$nulls":6},"Ｓウォーク　Ｎ３【黄】","W490  L914",null,{"v":20,"d":"結束数：20"},"　布板・コーナーステップ","Ｓウォーク","ACN3",{"v":9.5,"d":"9.50"}]
[{"$nulls":6},"Ｓウォーク　３２４【黄】","W240  L914",null,{"v":20,"d":"結束数：20"},"　布板・コーナーステップ","Ｓウォーク","ACN324",{"v":5.8,"d":"5.80"}]
[{"$nulls":6},"Ｓウォーク　Ｎ２【青】","W490  L610",null,{"v":20,"d":"結束数：20"},"　布板・コーナーステップ","Ｓウォーク","ACN2",{"v":7.3,"d":"7.30"}]
[{"$nulls":6},"Ｓウォーク　２２４【青】","W240  L610",null,{"v":20,"d":"結束数：20"},"　布板・コーナーステップ","Ｓウォーク","ACN224",{"v":4.7,"d":"4.70"}]
[{"$nulls":6},"タラップ付布板１９","W462　L1829（開口部：700×415）",null,{"v":20,"d":"結束数：20"},"　布板・コーナーステップ","Ｓウォーク","SKV19",{"v":17.4,"d":"17.40"}]
[{"$nulls":6},"全開閉式アルミ布板１８","W490　L1829（開口部：1555×415）",null,{"v":20,"d":"結束数：20"},"　布板・コーナーステップ","Ｓウォーク","ACRT18",{"v":12.5,"d":"12.50"}]
[{"$nulls":6},"Ｇウォーク　Ｎ６　　　　　　※要在庫確認","W490  L1829　すき間塞ぎなしタイプ",null,{"v":20,"d":"結束数：20"},"　布板・コーナーステップ","Ｇウォーク","ACG6",{"v":13.9,"d":"13.90"}]
[{"$nulls":6},"Ｇウォーク　６２４　　　　　※要在庫確認","W240  L1829　すき間塞ぎなしタイプ",null,{"v":20,"d":"結束数：20"},"　布板・コーナーステップ","Ｇウォーク","ACG624",{"v":7.7,"d":"7.70"}]
[{"$nulls":6},"Ｇウォーク　Ｎ５【黄】　　　※要在庫確認","W490  L1524　すき間塞ぎなしタイプ",null,{"v":20,"d":"結束数：20"},"　布板・コーナーステップ","Ｇウォーク","ACG5",{"v":11.7,"d":"11.70"}]
[{"$nulls":6},"Ｇウォーク　５２４【黄】　　※要在庫確認","W240  L1524　すき間塞ぎなしタイプ",null,{"v":20,"d":"結束数：20"},"　布板・コーナーステップ","Ｇウォーク","ACG524",{"v":6.6,"d":"6.60"}]
[{"$nulls":6},"Gウォーク　Ｎ４【青】　　　※要在庫確認","W490  L1219　すき間塞ぎなしタイプ",null,{"v":20,"d":"結束数：20"},"　布板・コーナーステップ","Ｇウォーク","ACG4",{"v":9.9,"d":"9.90"}]
[{"$nulls":6},"Ｇウォーク　４２４【青】　　※要在庫確認","W240  L1219　すき間塞ぎなしタイプ",null,{"v":20,"d":"結束数：20"},"　布板・コーナーステップ","Ｇウォーク","ACG424",{"v":5.7,"d":"5.70"}]
[{"$nulls":6},"Ｇウォーク　Ｎ３【黄】　　　※要在庫確認","W490  L914　すき間塞ぎなしタイプ",null,{"v":20,"d":"結束数：20"},"　布板・コーナーステップ","Ｇウォーク","ACG3",{"v":7.7,"d":"7.70"}]
[{"$nulls":6},"Gウォーク　３２４【黄】　　※要在庫確認","W240  L914　すき間塞ぎなしタイプ",null,{"v":20,"d":"結束数：20"},"　布板・コーナーステップ","Ｇウォーク","ACG324",{"v":4.7,"d":"4.70"}]
[{"$nulls":6},"Ｇウォーク　Ｎ２【青】　　　※要在庫確認","W490  L610　すき間塞ぎなしタイプ",null,{"v":20,"d":"結束数：20"},"　布板・コーナーステップ","Ｇウォーク","ACG2",{"v":5.9,"d":"5.90"}]
[{"$nulls":6},"Ｇウォーク　２２４【青】　　※要在庫確認","W240  L610　すき間塞ぎなしタイプ",null,{"v":20,"d":"結束数：20"},"　布板・コーナーステップ","Ｇウォーク","ACG224",{"v":3.8,"d":"3.80"}]
[{"$nulls":6},"ＳＰすき間ステップ","W490  L500　コーナー用",null,{"v":25,"d":"結束数：25"},"　布板・コーナーステップ","すき間ステップ・コーナーステップ","SKSP",{"v":8.3,"d":"8.30"}]
[{"$nulls":6},"ＳＰすき間ステップハーフ","W240  L500　コーナー用",null,{"v":25,"d":"結束数：25"},"　布板・コーナーステップ","すき間ステップ・コーナーステップ","SKSP24",{"v":4.6,"d":"4.60"}]
[{"$nulls":6},"コーナーステップ","W490  L220　コーナー用",null,{"v":25,"d":"結束数：25"},"　布板・コーナーステップ","すき間ステップ・コーナーステップ","SKCS",{"v":2.6,"d":"2.60"}]
[{"$nulls":6},"コーナーステップ２４","W240  L220　コーナー用",null,{"v":25,"d":"結束数：25"},"　布板・コーナーステップ","すき間ステップ・コーナーステップ","SKCS24",{"v":1.5,"d":"1.50"}]
[{"$nulls":6},"ＹＴすき間板０６","L606 W440　ステージ用",null,{"v":100,"d":"結束数：100"},"　布板・コーナーステップ","すき間ステップ・コーナーステップ","YTSK06",{"v":4.2,"d":"4.20"}]
[{"$nulls":6},"ＹＴすき間板０９","L910 W440　ステージ用",null,{"v":80,"d":"結束数：80"},"　布板・コーナーステップ","すき間ステップ・コーナーステップ","YTSK09",{"v":6.3,"d":"6.30"}]
[{"$nulls":6},"法面２号本体１２型【黄】","L1380 W720（内570）取付角度20～70°",null,{"v":10,"d":"結束数：10"},"　ハシゴ・キャタツ・法面階段","法面階段・ハイステップ","YVK12",{"v":15,"d":"15.00"}]
[{"$nulls":6},"法面２号手すり１２型【黄】","本体1に対し左右で2本使用",{"$f":"I94*2","v":{"v":0,"d":"0 "}},{"v":10,"d":"結束数：10"},"　ハシゴ・キャタツ・法面階段","法面階段・ハイステップ","YVKT12",{"v":3.3,"d":"3.30"}]
[{"$nulls":6},"法面２号本体２０型【黄緑】","L2415 W720（内570）取付角度20～70°",null,{"v":10,"d":"結束数：10"},"　ハシゴ・キャタツ・法面階段","法面階段・ハイステップ","YVK20",{"v":22.5,"d":"22.50"}]
[{"$nulls":6},"法面２号手すり２０型【黄緑】","本体1に対し左右で2本使用",{"$f":"I96*2","v":{"v":0,"d":"0 "}},{"v":10,"d":"結束数：10"},"　ハシゴ・キャタツ・法面階段","法面階段・ハイステップ","YVKT20",{"v":4.2,"d":"4.20"}]
[{"$nulls":6},"法面２号本体３０型【ピンク】","L3105 W720（内570）取付角度20～70°",null,{"v":10,"d":"結束数：10"},"　ハシゴ・キャタツ・法面階段","法面階段・ハイステップ","YVK30",{"v":28.5,"d":"28.50"}]
[{"$nulls":6},"法面２号手すり３０型【ピンク】","本体1に対し左右で2本使用",{"$f":"I98*2","v":{"v":0,"d":"0 "}},{"v":10,"d":"結束数：10"},"　ハシゴ・キャタツ・法面階段","法面階段・ハイステップ","YVKT30",{"v":4.8,"d":"4.80"}]
[{"$nulls":6},"ハイステップ　６００","W678（ステップ巾：553）",null,{"v":50,"d":"結束数：50"},"　ハシゴ・キャタツ・法面階段","法面階段・ハイステップ","XU2",{"v":5.2,"d":"5.20"}]
[{"$nulls":6},"ハイステップ　９００","W995（ステップ巾：870）",null,{"v":50,"d":"結束数：50"},"　ハシゴ・キャタツ・法面階段","法面階段・ハイステップ","XU3",{"v":6.1,"d":"6.10"}]
[{"$nulls":6},"アルスピーダー固定金具","φ42.7・φ48.6兼用",null,{"v":30,"d":"梱包数：30"},"　巾木","アルスピーダー","ACHKK",{"v":0.6,"d":"0.60"},30]
[{"$nulls":6},"アルスピーダー固定金具外コーナー","外コーナー（外側用）",null,{"v":5,"d":"梱包数：5"},"　巾木","アルスピーダー","ACHKKS",{"v":1.8,"d":"1.80"},5]
[{"$nulls":6},"アルスピーダー固定金具内コーナー","内コーナー（躯体側用）",null,{"v":5,"d":"梱包数：5"},"　巾木","アルスピーダー","ACHKKU",{"v":1.8,"d":"1.80"},5]
[{"$nulls":6},"アルスピーダー０６妻（幅木）","妻側用　W610　H180",null,{"v":50,"d":"結束数：50"},"　巾木","アルスピーダー","ACHKS06",{"v":0.5,"d":"0.50"}]
[{"$nulls":6},"アルスピーダー０９妻（幅木）【ピンク】","妻側用　W914　H180",null,{"v":50,"d":"結束数：50"},"　巾木","アルスピーダー","ACHKS09",{"v":0.8,"d":"0.80"}]
[{"$nulls":6},"アルスピーダー１１妻（幅木）【黄緑】","妻側用　W1107　H180",null,{"v":50,"d":"結束数：50"},"　巾木","アルスピーダー","ACHKS11",{"v":1,"d":"1.00"}]
[{"$nulls":6},"アルスピーダー１２妻（幅木）【青】","妻側用　W1219　H180",null,{"v":50,"d":"結束数：50"},"　巾木","アルスピーダー","ACHKS12",{"v":1.1,"d":"1.10"}]
[{"$nulls":6},"アルスピーダー２０（幅木）","L2000　H180",null,{"v":50,"d":"結束数：50"},"　巾木","アルスピーダー","ACHKS20",{"v":1.8,"d":"1.80"}]
[{"$nulls":6},"アルスピーダー４０（幅木）","L4000　H180",null,{"v":50,"d":"結束数：50"},"　巾木","アルスピーダー","ACHKS40",{"v":3.5,"d":"3.50"}]
[{"$nulls":6},"２ＷＡＹ０６（Ｌ型開閉幅木）","L610　H180　※妻側用ではありません",null,{"v":20,"d":"結束数：20"},"　巾木","2WAY（L型巾木）","ACHKT06",{"v":2.3,"d":"2.30"}]
[{"$nulls":6},"２ＷＡＹ０９（Ｌ型開閉幅木）【黄】","L914　H180　※妻側用ではありません",null,{"v":20,"d":"結束数：20"},"　巾木","2WAY（L型巾木）","ACHKT09",{"v":3,"d":"3.00"}]
[{"$nulls":6},"２ＷＡＹ１２（Ｌ型開閉幅木）【青】","L1219　H180　※妻側用ではありません",null,{"v":20,"d":"結束数：20"},"　巾木","2WAY（L型巾木）","ACHKT12",{"v":3.7,"d":"3.70"}]
[{"$nulls":6},"２ＷＡＹ１５（Ｌ型開閉幅木）【黄】","L1524　H180",null,{"v":20,"d":"結束数：20"},"　巾木","2WAY（L型巾木）","ACHKT15",{"v":4.4,"d":"4.40"}]
[{"$nulls":6},"２ＷＡＹ１８（Ｌ型開閉幅木）","L1829　H180",null,{"v":20,"d":"結束数：20"},"　巾木","2WAY（L型巾木）","ACHKT18",{"v":5.1,"d":"5.10"}]
[{"$nulls":6},"２ＷＡＹ妻側１２（L型幅木）","妻側用　W1219　H160",null,{"v":10,"d":"結束数：10"},"　巾木","2WAY（L型巾木）","ACE2W12",4.64]
[{"$nulls":6},"２ＷＡＹ妻側６９（L型幅木）","妻側用　W600～914　H160",null,{"v":10,"d":"結束数：10"},"　巾木","2WAY（L型巾木）","ACE2W69",3.86]
[{"$nulls":6},"パイプジャッキベース","□140　調整長100～345",null,null,"　ジャッキベース・大引受ジャッキ","ジャッキベース・大引受ジャッキ","AJP",{"v":2.7,"d":"2.70"}]
[{"$nulls":6},"自在ジャッキ","□140　調節長100～250",null,null,"　ジャッキベース・大引受ジャッキ","ジャッキベース・大引受ジャッキ","PIJ",{"v":3.6,"d":"3.60"}]
[{"$nulls":6},"ピポットジャッキ","□120×150調節長100～250",null,null,"　ジャッキベース・大引受ジャッキ","ジャッキベース・大引受ジャッキ","X0094",{"v":3.5,"d":"3.50"}]
[{"$nulls":6},"大引受ジャッキ","□150　調節長100～250",null,null,"　ジャッキベース・大引受ジャッキ","ジャッキベース・大引受ジャッキ","AO752",{"v":5.1,"d":"5.10"}]
[{"$nulls":6},"大引受ジャッキ　ロング","□150　調節長100～450",null,null,"　ジャッキベース・大引受ジャッキ","ジャッキベース・大引受ジャッキ","AO752L",{"v":6.5,"d":"6.50"}]
[{"$nulls":6},"３Ｔダブル大引受ジャッキ","□140×210　調節長100～350",null,null,"　ジャッキベース・大引受ジャッキ","ジャッキベース・大引受ジャッキ","HOJ",{"v":5.8,"d":"5.80"}]
[{"$nulls":6},"シキカク（２０×３０）","W200  L300　ｔ35",null,null,"　敷板","敷板","US033",{"v":1.2,"d":"1.20"}]
[{"$nulls":6},"杉　敷板　２Ｍ　（Ｃ級）","W200  L2000　ｔ35",null,{"v":50,"d":"結束数：50"},"　敷板","敷板","US23",{"v":9,"d":"9.00"}]
[{"$nulls":6},"杉　敷板　４Ｍ　（Ｃ級）【ピンク】","W200  L4000　ｔ35",null,{"v":50,"d":"結束数：50"},"　敷板","敷板","US43",{"v":18,"d":"18.00"}]
[{"$nulls":6},"壁つなぎ控え（H形鋼用）","フランジ：125～310用",null,null,"　壁つなぎ","壁つなぎ","NKH",{"v":1.5,"d":"1.50"}]
[{"$nulls":6},"壁つなぎＮＫ１４１６","L140～160",null,{"v":20,"d":"梱包数：20"},"　壁つなぎ","壁つなぎ","NK1416",{"v":0.8,"d":"0.80"},20]
[{"$nulls":6},"壁つなぎＮＫ１６２０","L160～200",null,{"v":20,"d":"梱包数：20"},"　壁つなぎ","壁つなぎ","NK1620",0.85,20]
[{"$nulls":6},"壁つなぎＮＫ１９２５","L190～250",null,{"v":20,"d":"梱包数：20"},"　壁つなぎ","壁つなぎ","NK1925",0.95,20]
[{"$nulls":6},"壁つなぎＮＫ２４３４","L240～340",null,{"v":20,"d":"梱包数：20"},"　壁つなぎ","壁つなぎ","NK2434",{"v":1.1,"d":"1.10"},20]
[{"$nulls":6},"壁つなぎＮＫ３３５２","L330～520",null,{"v":15,"d":"梱包数：15"},"　壁つなぎ","壁つなぎ","NK3352",{"v":1.4,"d":"1.40"},15]
[{"$nulls":6},"壁つなぎＮＫ５０７２","L500～720",null,{"v":10,"d":"梱包数：10"},"　壁つなぎ","壁つなぎ","NK5072",{"v":1.8,"d":"1.80"},10]
[{"$nulls":6},"壁つなぎＮＫ７０９２【赤】","L700～920",null,{"v":5,"d":"梱包数：5"},"　壁つなぎ","壁つなぎ","NK7092",{"v":2.5,"d":"2.50"},5]
[{"$nulls":6},"壁つなぎＮＫ９０１１２【青】","L900～1120",null,{"v":5,"d":"梱包数：5"},"　壁つなぎ","壁つなぎ","NK90112",2.94,5]
[{"$nulls":6},"兼用クランプ（Ｈ）　直交","兼用φ42.7・φ48.6",null,{"v":20,"d":"梱包数：20"},"　クランプ類","クランプ・ジョイント・固定ベース","KCC10",0.78,20]
[{"$nulls":6},"兼用クランプ（Ｈ）　自在","兼用φ42.7・φ48.6",null,{"v":20,"d":"梱包数：20"},"　クランプ類","クランプ・ジョイント・固定ベース","KCC11",0.78,20]
[{"$nulls":6},"ダブルロックジョイント","φ48.6パイプ用",null,{"v":30,"d":"梱包数：30"},"　クランプ類","クランプ・ジョイント・固定ベース","PSP",{"v":0.6,"d":"0.60"},30]
[{"$nulls":6},"固定ベース","□120　φ48.6　",null,{"v":20,"d":"梱包数：20"},"　クランプ類","クランプ・ジョイント・固定ベース","PK",0.85,20]
[{"$nulls":6},"回転ベース","□120　φ48.6　",null,{"v":20,"d":"梱包数：20"},"　クランプ類","クランプ・ジョイント・固定ベース","PKJ",1.17,20]
[{"$nulls":6},"鉄骨スイッチクランプ　固定","掴み：0～40　兼用φ42.7・φ48.6",null,{"v":20,"d":"梱包数：20"},"　クランプ類","クランプ・ジョイント・固定ベース","CKMK20",{"v":1.1,"d":"1.10"},20]
[{"$nulls":6},"鉄骨スイッチクランプ　自在","掴み：0～40　兼用φ42.7・φ48.6",null,{"v":20,"d":"梱包数：20"},"　クランプ類","クランプ・ジョイント・固定ベース","CKMK21",{"v":1.1,"d":"1.10"},20]
[{"$nulls":6},"座マルキャッチ100","掴み：6～100　兼用φ42.7・φ48.6",null,{"v":10,"d":"梱包数：10"},"　クランプ類","クランプ・ジョイント・固定ベース","CKMKL100",{"v":2.1,"d":"2.10"},10]
[{"$nulls":6},"単管パイプ　０．６Ｍ　バタ","ピン無しバタ",null,{"v":50,"d":"結束数：50"},"　単管パイプ","単管パイプ","PP06",{"v":1.638,"d":"1.64"}]
[{"$nulls":6},"単管パイプ　１．２Ｍ　バタ","ピン無しバタ",null,{"v":50,"d":"結束数：50"},"　単管パイプ","単管パイプ","PP12",{"v":3.276,"d":"3.28"}]
[{"$nulls":6},"単管パイプ　１．０Ｍ　ピン付","スーパーライト",null,{"v":50,"d":"結束数：50"},"　単管パイプ","単管パイプ","PP10",2.08]
[{"$nulls":6},"単管パイプ　１．５Ｍ　ピン付","スーパーライト",null,{"v":50,"d":"結束数：50"},"　単管パイプ","単管パイプ","PP15",3.12]
[{"$nulls":6},"単管パイプ　２．０Ｍ　ピン付","スーパーライト",null,{"v":50,"d":"結束数：50"},"　単管パイプ","単管パイプ","PP20",4.16]
[{"$nulls":6},"単管パイプ　２．５Ｍ　ピン付","スーパーライト",null,{"v":50,"d":"結束数：50"},"　単管パイプ","単管パイプ","PP25",{"v":5.2,"d":"5.20"}]
[{"$nulls":6},"単管パイプ　３．０Ｍ　ピン付","スーパーライト",null,{"v":50,"d":"結束数：50"},"　単管パイプ","単管パイプ","PP30",6.24]
[{"$nulls":6},"単管パイプ　３．５Ｍ　ピン付","スーパーライト",null,{"v":50,"d":"結束数：50"},"　単管パイプ","単管パイプ","PP35",7.28]
[{"$nulls":6},"単管パイプ　４．０Ｍ　ピン付","スーパーライト",null,{"v":50,"d":"結束数：50"},"　単管パイプ","単管パイプ","PP40",8.32]
[{"$nulls":6},"くい　１．２","打込み用パイプ　φ48.6",null,{"v":50,"d":"結束数：50"},"　単管パイプ","打ち込みパイプ","PUK12",{"v":3.3,"d":"3.30"}]
[{"$nulls":6},"結束枠","W500　H405（2枠で1セット）",null,{"v":10,"d":"結束数：10"},"　単管パイプ","結束枠","HZGT",{"v":5.1,"d":"5.10"}]
[{"$nulls":6},"アルミメッシュS","W311  L632　すき間塞ぎ用",null,{"v":50,"d":"結束数：50"},"　足場板","アルミ足場板・すき間塞ぎ板","ALMS",{"v":1.3,"d":"1.30"}]
[{"$nulls":6},"アルミ足場板　０．５Ｍ","W240  L500",null,{"v":30,"d":"結束数：30"},"　足場板","アルミ足場板・すき間塞ぎ板","ACAL05SO",{"v":1.4,"d":"1.40"}]
[{"$nulls":6},"アルミ足場板　１Ｍ","W240  L1000",null,{"v":30,"d":"結束数：30"},"　足場板","アルミ足場板・すき間塞ぎ板","ACAL10SO",{"v":2.1,"d":"2.10"}]
[{"$nulls":6},"アルミ足場板　１．５Ｍ","W240  L1500",null,{"v":30,"d":"結束数：30"},"　足場板","アルミ足場板・すき間塞ぎ板","ACAL15SO",{"v":3.1,"d":"3.10"}]
[{"$nulls":6},"アルミ足場板　２Ｍ","W240  L2000",null,{"v":30,"d":"結束数：30"},"　足場板","アルミ足場板・すき間塞ぎ板","ACAL20SO",{"v":6.1,"d":"6.10"}]
[{"$nulls":6},"アルミ足場板　３Ｍ","W240  L3000",null,{"v":30,"d":"結束数：30"},"　足場板","アルミ足場板・すき間塞ぎ板","ACAL30SO",{"v":8.6,"d":"8.60"}]
[{"$nulls":6},"アルミ足場板　４Ｍ","W240  L4000",null,{"v":30,"d":"結束数：30"},"　足場板","アルミ足場板・すき間塞ぎ板","ACAL40SO",{"v":10.1,"d":"10.10"}]
[{"$nulls":6},"アルミ一連梯子３．０Ｍ","W421　H3098",null,{"v":10,"d":"結束数：10"},"　ハシゴ・キャタツ・法面階段","アルミハシゴ・モンキータラップ","ASAL30",{"v":6,"d":"6.00"}]
[{"$nulls":6},"アルミ一連梯子４．０Ｍ","W421　H4088",null,{"v":10,"d":"結束数：10"},"　ハシゴ・キャタツ・法面階段","アルミハシゴ・モンキータラップ","ASAL40",{"v":7.5,"d":"7.50"}]
[{"$nulls":6},"アルミ２連梯子５．０Ｍ","W421　H3150～5160",null,{"v":10,"d":"結束数：10"},"　ハシゴ・キャタツ・法面階段","アルミハシゴ・モンキータラップ","ASALW50",{"v":11.4,"d":"11.40"}]
[{"$nulls":6},"ジョイント梯子　２．０Ｍ","φ42.7　H2000",null,{"v":10,"d":"結束数：10"},"　ハシゴ・キャタツ・法面階段","アルミハシゴ・モンキータラップ","AS2000",{"v":12.7,"d":"12.70"}]
[{"$nulls":6},"ステップバー６１０","W610　兼用φ42.7・φ48.6",null,{"v":10,"d":"梱包数：10"},"　ハシゴ・キャタツ・法面階段","アルミハシゴ・モンキータラップ","ASB610",{"v":1.8,"d":"1.80"},10]
[{"$nulls":6},"モンキーヘッド　（モンキータラップ用最上部手摺）","H650　D250　本体1台に左右で2本使用",null,{"v":5,"d":"梱包数：5"},"　ハシゴ・キャタツ・法面階段","アルミハシゴ・モンキータラップ","ASH",{"v":2,"d":"2.00"},5]
[{"$nulls":6},"モンキータラップ１７００","W400　H1700",null,{"v":10,"d":"結束数：10"},"　ハシゴ・キャタツ・法面階段","アルミハシゴ・モンキータラップ","AS1700",{"v":12,"d":"12.00"}]
[{"$nulls":6},"キャタツ４型Ⅴ","H1190　",null,{"v":10,"d":"結束数：10"},"　ハシゴ・キャタツ・法面階段","キャタツ","GV4",{"v":11.2,"d":"11.20"}]
[{"$nulls":6},"キャタツ６型Ⅴ","H1735　",null,{"v":10,"d":"結束数：10"},"　ハシゴ・キャタツ・法面階段","キャタツ","GV6",{"v":15.6,"d":"15.60"}]
[{"$nulls":6},"ＳＰサポート10型","320～440　φ48.6×φ60.5",null,{"v":50,"d":"結束数：50"},"　パイプサポート","パイプサポート","SS10SP",{"v":4,"d":"4.00"}]
[{"$nulls":6},"ＳＰサポート15型【ピンク】","410～620　φ48.6×φ60.5",null,{"v":50,"d":"結束数：50"},"　パイプサポート","パイプサポート","SS15SP",{"v":4.5,"d":"4.50"}]
[{"$nulls":6},"ＳＰサポート20型【黄緑】","620～940　φ48.6×φ60.5",null,{"v":50,"d":"結束数：50"},"　パイプサポート","パイプサポート","SS20SP",{"v":6,"d":"6.00"}]
[{"$nulls":6},"ＳＰサポート30型【ピンク】","920～1415　φ48.6×φ60.5",null,{"v":50,"d":"結束数：50"},"　パイプサポート","パイプサポート","SS30SP",{"v":7.5,"d":"7.50"}]
[{"$nulls":6},"ＳＰサポート40型【黄緑】","1220～1995　φ48.6×φ60.5",null,{"v":50,"d":"結束数：50"},"　パイプサポート","パイプサポート","SS40SP",{"v":9.5,"d":"9.50"}]
[{"$nulls":6},"ＳＰサポート60型","1720～3040　φ48.6×φ60.5",null,{"v":50,"d":"結束数：50"},"　パイプサポート","パイプサポート","SS60SP",{"v":12.5,"d":"12.50"}]
[{"$nulls":6},"サポートクランプ　直交","φ48.6×φ60.5",null,{"v":20,"d":"梱包数：20"},"　パイプサポート","パイプサポート","CT0",{"v":0.8,"d":"0.80"},20]
[{"$nulls":6},"サポートクランプ　自在","φ48.6×φ60.5",null,{"v":20,"d":"梱包数：20"},"　パイプサポート","パイプサポート","CT1",{"v":0.8,"d":"0.80"},20]
[{"$nulls":6},"６０角バタ　　　１．０Ｍ　【青】","□60×60×2.3",null,{"v":50,"d":"結束数：50"},"　角パイプ","60角鋼管","KK10",4.06]
[{"$nulls":6},"６０角バタ　　　１．５Ｍ　【赤】","□60×60×2.3",null,{"v":50,"d":"結束数：50"},"　角パイプ","60角鋼管","KK15",6.09]
[{"$nulls":6},"６０角バタ　　　２．０Ｍ　【青】","□60×60×2.3",null,{"v":50,"d":"結束数：50"},"　角パイプ","60角鋼管","KK20",8.12]
[{"$nulls":6},"６０角バタ　　　２．５Ｍ　【赤】","□60×60×2.3",null,{"v":50,"d":"結束数：50"},"　角パイプ","60角鋼管","KK25",10.15]
[{"$nulls":6},"６０角バタ　　　３．０Ｍ　【青】","□60×60×2.3",null,{"v":50,"d":"結束数：50"},"　角パイプ","60角鋼管","KK30",12.18]
[{"$nulls":6},"６０角バタ　　　３．５Ｍ　【赤】","□60×60×2.3",null,{"v":50,"d":"結束数：50"},"　角パイプ","60角鋼管","KK35",14.21]
[{"$nulls":6},"６０角バタ　　　４．０Ｍ　【青】","□60×60×2.3",null,{"v":50,"d":"結束数：50"},"　角パイプ","60角鋼管","KK40",16.24]
[{"$nulls":6},"１００角バタ　　　１．０Ｍ　【青】","□100×100×3.2",null,{"v":25,"d":"結束数：25"},"　角パイプ","100角鋼管","OO10",9.52]
[{"$nulls":6},"１００角バタ　　　１．５Ｍ　【赤】","□100×100×3.2",null,{"v":25,"d":"結束数：25"},"　角パイプ","100角鋼管","OO15",14.28]
[{"$nulls":6},"１００角バタ　　　２．０Ｍ　【青】","□100×100×3.2",null,{"v":25,"d":"結束数：25"},"　角パイプ","100角鋼管","OO20",19.04]
[{"$nulls":6},"１００角バタ　　　２．５Ｍ　【赤】","□100×100×3.2",null,{"v":25,"d":"結束数：25"},"　角パイプ","100角鋼管","OO25",{"v":23.8,"d":"23.80"}]
[{"$nulls":6},"１００角バタ　　　３．０Ｍ　【青】","□100×100×3.2",null,{"v":25,"d":"結束数：25"},"　角パイプ","100角鋼管","OO30",28.56]
[{"$nulls":6},"１００角バタ　　　３．５Ｍ　【赤】","□100×100×3.2",null,{"v":25,"d":"結束数：25"},"　角パイプ","100角鋼管","OO35",33.32]
[{"$nulls":6},"１００角バタ　　　４．０Ｍ　【青】","□100×100×3.2",null,{"v":25,"d":"結束数：25"},"　角パイプ","100角鋼管","OO40",38.08]
[{"$nulls":6},"チェーン付クランプ（チェーン）","W820　1セット：チェーン1本＋クランプ2個",null,{"v":10,"d":"梱包数：10"},"　チェーン","出入口用チェーン","PCC1",0.45,10]
[{"$nulls":6},"チェーン付クランプ（クランプ）","兼用φ42.7・φ48.6",{"$f":"I193*2","v":{"v":0,"d":"0 "}},"セット品","　チェーン","出入口用チェーン","PCC2",0.45]
[{"$nulls":6},"ロック付チェーン２Ｍ","外れ止めロック付",null,{"v":10,"d":"梱包数：10"},"　チェーン","吊チェーン","PCR20",{"v":1.5,"d":"1.50"},10]
[{"$nulls":6},"ロック付チェーン３Ｍ","外れ止めロック付",null,{"v":10,"d":"梱包数：10"},"　チェーン","吊チェーン","PCR30",{"v":2.2,"d":"2.20"},10]
[{"$nulls":6},"ロック付チェーン４Ｍ","外れ止めロック付",null,{"v":5,"d":"梱包数：5"},"　チェーン","吊チェーン","PCR40",{"v":2.9,"d":"2.90"},5]
[{"$nulls":6},"ロック付チェーン５Ｍ","外れ止めロック付",null,{"v":5,"d":"梱包数：5"},"　チェーン","吊チェーン","PCR50",{"v":3.2,"d":"3.20"},5]
[{"$nulls":6},"座キャッチ３７チェーン固定用","掴み：0～100",null,{"v":20,"d":"梱包数：20"},"　チェーン","吊チェーン","CK1J",{"v":0.8,"d":"0.80"},20]
[{"$nulls":6},"ロングチェーン金具","掴み：6～100",null,{"v":10,"d":"結束数：10"},"　チェーン","吊チェーン","CK1L",{"v":1.5,"d":"1.50"},10]
[{"$nulls":6},"単管バリケード【青】","H770・H220　W560　1セット2台使用",null,{"v":10,"d":"結束数：10"},"　マルチパレット・キャスター・バリケードなど","単管バリケード・OKマット","PB",{"v":4,"d":"4.00"}]
[{"$nulls":6},"ＯＫマット【青】","W450×L2000",null,{"v":50,"d":"結束数：50"},"　マルチパレット・キャスター・バリケードなど","単管バリケード・OKマット","OKM",{"v":6,"d":"6.00"}]
[{"$nulls":6},"ホワイトキャスター８吋","調節長：272～472",null,null,"　マルチパレット・キャスター・バリケードなど","キャスター・アウトリガー","AGW8",{"v":7.4,"d":"7.40"}]
[{"$nulls":6},"SPアウトリガー","W600　H760（625）",null,{"v":4,"d":"結束数：4"},"　マルチパレット・キャスター・バリケードなど","キャスター・アウトリガー","ARSP",{"v":10.2,"d":"10.20"}]
[{"$nulls":6},"ロクリン（アルミ6輪1トン台車）","W755　D1205　H263",null,null,"　マルチパレット・キャスター・バリケードなど","マルチパレット・アルミ台車","NAC6",{"v":29.5,"d":"29.50"}]
[{"$nulls":6},"コンボキシィ（車輪付）","W1066　D913　H729",null,null,"　マルチパレット・キャスター・バリケードなど","マルチパレット・アルミ台車","MPNC",{"v":98.4,"d":"98.40"}]
[{"$nulls":6},"マルチパレット","W1129　D953　H690",null,null,"　マルチパレット・キャスター・バリケードなど","マルチパレット・アルミ台車","MPS",{"v":98,"d":"98.00"}]
[{"$nulls":6},"マルチパレットハーフ","W1072　D915　H400",null,null,"　マルチパレット・キャスター・バリケードなど","マルチパレット・アルミ台車","MPSH",{"v":65,"d":"65.00"}]
[{"$nulls":6},"ＹＴ支柱１８","H1800 φ48.6",null,{"v":50,"d":"結束数：50"},"　YTロックシステム","YT支柱・カラー材","YTP18",{"v":6.3,"d":"6.30"}]
[{"$nulls":6},"ＹＴ支柱０９","H900 φ48.6",null,{"v":50,"d":"結束数：50"},"　YTロックシステム","YT支柱・カラー材","YTP09",{"v":3.4,"d":"3.40"}]
[{"$nulls":6},"ＹＴ支柱０４５","H450 φ48.6",null,{"v":100,"d":"結束数：100"},"　YTロックシステム","YT支柱・カラー材","YTP045",{"v":2.3,"d":"2.30"}]
[{"$nulls":6},"ＹＴ支柱０２２５","H225 φ48.6",null,{"v":100,"d":"結束数：100"},"　YTロックシステム","YT支柱・カラー材","YTP0225",{"v":1.4,"d":"1.40"}]
[{"$nulls":6},"ＹＴヘッド支柱０９","上部ホゾ無　H900",null,{"v":50,"d":"結束数：50"},"　YTロックシステム","YT支柱・カラー材","YTP09H",{"v":2.8,"d":"2.80"}]
[{"$nulls":6},"YTトップカラー５４３","L1829　φ42.7",null,{"v":50,"d":"結束数：50"},"　YTロックシステム","YT支柱・カラー材","YTKR543",{"v":4.6,"d":"4.60"}]
[{"$nulls":6},"YTトップカラー２２５","L1829　φ42.7",null,{"v":50,"d":"結束数：50"},"　YTロックシステム","YT支柱・カラー材","YTKR225",{"v":4.6,"d":"4.60"}]
[{"$nulls":6},"YTカラー材１２０","L1829　φ42.7",null,{"v":50,"d":"結束数：50"},"　YTロックシステム","YT支柱・カラー材","YTKR120",{"v":4.6,"d":"4.60"}]
[{"$nulls":6},"ＹＴ水平材１８","L1829　φ42.7",null,{"v":50,"d":"結束数：50"},"　YTロックシステム","YT水平材・YT先行ブレース","YTSC18",{"v":4.6,"d":"4.60"}]
[{"$nulls":6},"ＹＴ水平材１５","L1524　φ42.7",null,{"v":50,"d":"結束数：50"},"　YTロックシステム","YT水平材・YT先行ブレース","YTSC15",{"v":3.9,"d":"3.90"}]
[{"$nulls":6},"ＹＴ水平材１２","W・L1219　φ42.7",null,{"v":50,"d":"結束数：50"},"　YTロックシステム","YT水平材・YT先行ブレース","YTSC12",{"v":3.3,"d":"3.30"}]
[{"$nulls":6},"ＹＴ水平材０９","W・L914　φ42.7",null,{"v":50,"d":"結束数：50"},"　YTロックシステム","YT水平材・YT先行ブレース","YTSC09",{"v":2.5,"d":"2.50"}]
[{"$nulls":6},"ＹＴ水平材０６","W・L610　φ42.7",null,{"v":50,"d":"結束数：50"},"　YTロックシステム","YT水平材・YT先行ブレース","YTSC06",{"v":1.7,"d":"1.70"}]
[{"$nulls":6},"ＹＴ水平材０３","L305　φ42.7",null,{"v":20,"d":"結束数：20"},"　YTロックシステム","YT水平材・YT先行ブレース","YTSC03",{"v":1,"d":"1.00"}]
[{"$nulls":6},"ＹＴ水平材０１","L150　φ42.7",null,{"v":25,"d":"結束数：25"},"　YTロックシステム","YT水平材・YT先行ブレース","YTSC01",{"v":0.5,"d":"0.50"}]
[{"$nulls":6},"ＹＴ斜面ブラケット９０９","張出914",null,{"v":30,"d":"結束数：30"},"　YTロックシステム","YTカイダン類・ブラケット","YTBK909",{"v":9.7,"d":"9.70"}]
[{"$nulls":6},"ＹＴ斜面ブラケット６０９","張出610",null,{"v":30,"d":"結束数：30"},"　YTロックシステム","YTカイダン類・ブラケット","YTBK609",{"v":8.6,"d":"8.60"}]
[{"$nulls":6},"ＹＴピンブラケット３０４","張出305　ピン付",null,{"v":30,"d":"結束数：30"},"　YTロックシステム","YTカイダン類・ブラケット","YTPK304",{"v":2.8,"d":"2.80"}]
[{"$nulls":6},"ＹＴ先行ブレース１８","L1829　H900",null,{"v":50,"d":"結束数：50"},"　YTロックシステム","YT水平材・YT先行ブレース","YTST18",{"v":6.6,"d":"6.60"}]
[{"$nulls":6},"ＹＴ先行ブレース１５","L1524　H900",null,{"v":50,"d":"結束数：50"},"　YTロックシステム","YT水平材・YT先行ブレース","YTST15",{"v":5.8,"d":"5.80"}]
[{"$nulls":6},"ＹＴ先行ブレース１２","L1219　H900",null,{"v":50,"d":"結束数：50"},"　YTロックシステム","YT水平材・YT先行ブレース","YTST12",{"v":5,"d":"5.00"}]
[{"$nulls":6},"ＹＴ先行ブレース０９","L914　H900",null,{"v":50,"d":"結束数：50"},"　YTロックシステム","YT水平材・YT先行ブレース","YTST09",{"v":4.2,"d":"4.20"}]
[{"$nulls":6},"ＳＰカイダン","6段　W471　L2275",null,{"v":10,"d":"結束数：10"},"　YTロックシステム","YTカイダン類・ブラケット","VKSP",{"v":10.5,"d":"10.50"}]
[{"$nulls":6},"ＳＰカイダン手摺","二段一体式",null,{"v":10,"d":"結束数：10"},"　YTロックシステム","YTカイダン類・ブラケット","VKTSP",{"v":4.2,"d":"4.20"}]
[{"$nulls":6},"ＹＴ吊り金具　（YTポケット専用）","4点吊り＝1セット：4個使用",null,"1セット：4","　YTロックシステム","YTカイダン類・ブラケット","YTTG",{"v":0.7,"d":"0.70"}]
[{"$nulls":6},"ＹＴＳブレース０６０９　【ムラサキ】    ","W610×H900",null,{"v":20,"d":"結束数：20"},"　YTロックシステム","YTSブレース","YTS0609",{"v":2.9,"d":"2.90"}]
[{"$nulls":6},"ＹＴＳブレース０９０９　【黒】    ","W610×H1350・W914×H900",null,{"v":20,"d":"結束数：20"},"　YTロックシステム","YTSブレース","YTS0909",{"v":3.5,"d":"3.50"}]
[{"$nulls":6},"ＹＴＳブレース０９１８   ","W610×H1800・W914×H1800・W1219×H1350",null,{"v":20,"d":"結束数：20"},"　YTロックシステム","YTSブレース","YTS0918",{"v":4.5,"d":"4.50"}]
[{"$nulls":6},"ＹＴＳブレース１２０９　【青】    ","W914×H1350・W1219×H900",null,{"v":20,"d":"結束数：20"},"　YTロックシステム","YTSブレース","YTS1209",{"v":4.1,"d":"4.10"}]
[{"$nulls":6},"ＹＴＳブレース１８０９　【黄】    ","W1219×H1800・W1524×H1800・W1829×H900",null,{"v":20,"d":"結束数：20"},"　YTロックシステム","YTSブレース","YTS1809",{"v":5.4,"d":"5.40"}]
[{"$nulls":6},"ＹＴＳブレース１８１８　【緑】    ","W1829×H1800",null,{"v":20,"d":"結束数：20"},"　YTロックシステム","YTSブレース","YTS1818",{"v":6.2,"d":"6.20"}]
[{"$nulls":6},"ＹＴＤブレース０６０９","W610×H900",null,{"v":50,"d":"結束数：50"},"　YTロックシステム","YTDブレース","YTD0609",{"v":4.6,"d":"4.60"}]
[{"$nulls":6},"ＹＴＤブレース０６１８","W610×H1800・W1524×H900",null,{"v":50,"d":"結束数：50"},"　YTロックシステム","YTDブレース","YTD0618",{"v":6.6,"d":"6.60"}]
[{"$nulls":6},"ＹＴＤブレース０９０９","W914×H900",null,{"v":50,"d":"結束数：50"},"　YTロックシステム","YTDブレース","YTD0909",{"v":5.2,"d":"5.20"}]
[{"$nulls":6},"ＹＴＤブレース０９１８    ","W914×H1800",null,{"v":50,"d":"結束数：50"},"　YTロックシステム","YTDブレース","YTD0918",{"v":6.9,"d":"6.90"}]
[{"$nulls":6},"ＹＴＤブレース１２０９","W1219×H900",null,{"v":50,"d":"結束数：50"},"　YTロックシステム","YTDブレース","YTD1209",{"v":5.9,"d":"5.90"}]
[{"$nulls":6},"ＹＴＤブレース１２１８","W1219×H1800・W1829×H900",null,{"v":50,"d":"結束数：50"},"　YTロックシステム","YTDブレース","YTD1818",{"v":7.3,"d":"7.30"}]
[{"$nulls":6},"*マキシムベース　１８型　可搬式作業台","H1355～1755　L1540　W500　",null,{"v":10,"d":"結束数：10"},"*可搬式作業台","立ち馬","XAT0303",{"v":29.5,"d":"29.50"}]
[{"$nulls":6},"*マキシムベース　１５型　可搬式作業台","H1040～1440　L1540　W500　",null,{"v":10,"d":"結束数：10"},"*可搬式作業台","立ち馬","XAT0304",{"v":28.5,"d":"28.50"}]
[{"$nulls":6},"*マキシムベース　１０型　可搬式作業台","H725～1125　L1540　W500　",null,{"v":10,"d":"結束数：10"},"*可搬式作業台","立ち馬","XAT0305",22.01]
[{"$nulls":6},"*ラッセルネット　０．５Ｘ６  Ｋ ","水平用１５㍉目合　橙･赤",null,{"v":10,"d":"梱包数：10"},"*親綱・ネット・シート類","水平ネット","WKY1101",{"v":2.5,"d":"2.50"}]
[{"$nulls":6},"*ラッセルネット　１Ｘ６  Ｋ   ","水平用１５㍉目合　黒･赤",null,{"v":10,"d":"梱包数：10"},"*親綱・ネット・シート類","水平ネット","WKY1102",{"v":3.7,"d":"3.70"}]
[{"$nulls":6},"*ラッセルネット　２Ｘ６   Ｋ   ","水平用１５㍉目合　黄･赤",null,{"v":6,"d":"梱包数：6"},"*親綱・ネット・シート類","水平ネット","WKY1103",{"v":5.7,"d":"5.70"}]
[{"$nulls":6},"*ラッセルネット　３Ｘ６  Ｋ   ","水平用１５㍉目合　緑･赤",null,{"v":4,"d":"梱包数：4"},"*親綱・ネット・シート類","水平ネット","WKY1104",{"v":7.5,"d":"7.50"}]
[{"$nulls":6},"*ラッセルネット　５Ｘ５   Ｋ   ","水平用１５㍉目合　青･青",null,{"v":3,"d":"梱包数：3"},"*親綱・ネット・シート類","水平ネット","WKY1106",{"v":10.5,"d":"10.50"}]
[{"$nulls":6},"*ラッセルネット　４Ｘ７  Ｋ   ","水平用１５㍉目合　緑･黒",null,{"v":3,"d":"梱包数：3"},"*親綱・ネット・シート類","水平ネット","WKY1105",{"v":11.3,"d":"11.30"}]
[{"$nulls":6},"*ラッセルネット　６Ｘ６   Ｋ   ","水平用１５㍉目合　赤･赤",null,{"v":2,"d":"梱包数：2"},"*親綱・ネット・シート類","水平ネット","WKY1108",{"v":13.8,"d":"13.80"}]
[{"$nulls":6},"*ラッセルネット　７Ｘ７  Ｋ   ","水平用１５㍉目合　黒･黒",null,{"v":2,"d":"梱包数：2"},"*親綱・ネット・シート類","水平ネット","WKY1109",{"v":18.6,"d":"18.60"}]
[{"$nulls":6},"*ラッセルネット　５Ｘ１０   Ｋ   ","水平用１５㍉目合　青･黄",null,{"v":2,"d":"梱包数：2"},"*親綱・ネット・シート類","水平ネット","WKY1107",{"v":19,"d":"19.00"}]
[{"$nulls":6},"*ラッセルネット　８Ｘ８   Ｋ   ","水平用１５㍉目合　橙･橙",null,{"v":1,"d":"梱包数：1"},"*親綱・ネット・シート類","水平ネット","WKY1111",{"v":24.5,"d":"24.50"}]
[{"$nulls":6},"*ラッセルネット　7Ｘ10   Ｋ   ","水平用１５㍉目合　黒･黄",null,{"v":1,"d":"梱包数：1"},"*親綱・ネット・シート類","水平ネット","WKY1113",{"v":26.8,"d":"26.80"}]
[{"$nulls":6},"*イエローネット防炎　1×6　KY","15㍉目合　注意喚起ネット",null,{"v":4,"d":"梱包数：4"},"*親綱・ネット・シート類","垂直ネット","WKY4180",{"v":3.7,"d":"3.70"}]
[{"$nulls":6},"*安全ネット　１Ｘ６   Ｋ   ","水平用１００㍉目合　黒･赤",null,{"v":10,"d":"梱包数：10"},"*親綱・ネット・シート類","水平ネット","WKY1206",{"v":3.2,"d":"3.20"}]
[{"$nulls":6},"*安全ネット　３Ｘ６   Ｋ   ","水平用１００㍉目合　緑赤･白",null,{"v":6,"d":"梱包数：6"},"*親綱・ネット・シート類","水平ネット","WKY1201",{"v":7.5,"d":"7.50"}]
[{"$nulls":6},"*安全ネット　５Ｘ５  Ｋ   ","水平用１００㍉目合　青･青",null,{"v":4,"d":"梱包数：4"},"*親綱・ネット・シート類","水平ネット","WKY1203",{"v":10.1,"d":"10.10"}]
[{"$nulls":6},"*安全ネット　６Ｘ６   Ｋ   ","水平用１００㍉目合　青･黄",null,{"v":3,"d":"梱包数：3"},"*親綱・ネット・シート類","水平ネット","WKY1204",{"v":13.6,"d":"13.60"}]
[{"$nulls":6},"*安全ネット　５Ｘ１０   Ｋ   ","水平用１００㍉目合　赤･赤",null,{"v":2,"d":"梱包数：2"},"*親綱・ネット・シート類","水平ネット","WKY1202",{"v":18.2,"d":"18.20"}]
[{"$nulls":6},"*安全ネット　８Ｘ８   Ｋ   ","水平用１００㍉目合　橙･橙",null,{"v":2,"d":"梱包数：2"},"*親綱・ネット・シート類","水平ネット","WKY1205",{"v":22.1,"d":"22.10"}]
[{"$nulls":6},"*安全ネット１０Ｘ１０   Ｋ   ","水平用１００㍉目合　黄･黄",null,{"v":1,"d":"梱包数：1"},"*親綱・ネット・シート類","水平ネット","WKY1207",{"v":38,"d":"38.00"}]
[{"$nulls":6},"*キョーワネット　１×１０   KY  ","垂直用１５㍉目合　黄",null,{"v":10,"d":"梱包数：10"},"*親綱・ネット・シート類","垂直ネット","WKY1401",{"v":3,"d":"3.00"}]
[{"$nulls":6},"*キョーワネット　３．６×１２    KY   ","垂直用１５㍉目合　緑",null,{"v":4,"d":"梱包数：4"},"*親綱・ネット・シート類","垂直ネット","WKY1402",{"v":8.8,"d":"8.80"}]
[{"$nulls":6},"*キョーワネット　　６×１２     KY   ","垂直用１５㍉目合　白",null,{"v":3,"d":"梱包数：3"},"*親綱・ネット・シート類","垂直ネット","WKY1404",{"v":14,"d":"14.00"}]
[{"$nulls":6},"*ブルーネット　　１Ｘ１０  　Ｋ   ","垂直用１５㍉目合　黄",null,{"v":10,"d":"梱包数：10"},"*親綱・ネット・シート類","垂直ネット","WKY1323",{"v":3,"d":"3.00"}]
[{"$nulls":6},"*ブルーネット　　６Ｘ６  　Ｋ   ","垂直用１５㍉目合　赤",null,{"v":5,"d":"梱包数：5"},"*親綱・ネット・シート類","垂直ネット","WKY1326",{"v":7,"d":"7.00"}]
[{"$nulls":6},"*ブルーネット３．６Ｘ１２  　Ｋ   ","垂直用１５㍉目合　白",null,{"v":4,"d":"梱包数：4"},"*親綱・ネット・シート類","垂直ネット","WKY1327",{"v":8.8,"d":"8.80"}]
[{"$nulls":6},"*ブルーネット　　６Ｘ１２  　Ｋ   ","垂直用１５㍉目合　白",null,{"v":3,"d":"梱包数：3"},"*親綱・ネット・シート類","垂直ネット","WKY1324",{"v":14,"d":"14.00"}]
[{"$nulls":6},"*シルバーネット　１Ｘ１０  　Ｋ   ","垂直用１５㍉目合　黄",null,{"v":10,"d":"梱包数：10"},"*親綱・ネット・シート類","垂直ネット","WKY1341",{"v":3,"d":"3.00"}]
[{"$nulls":6},"*シルバーネット　７Ｘ７  　Ｋ   ","垂直用１５㍉目合　黒",null,{"v":3,"d":"梱包数：3"},"*親綱・ネット・シート類","垂直ネット","WKY1344",{"v":9.8,"d":"9.80"}]
[{"$nulls":6},"*シルバーネット　４Ｘ１４  　Ｋ   ","垂直用１５㍉目合　緑",null,{"v":3,"d":"梱包数：3"},"*親綱・ネット・シート類","垂直ネット","WKY1342",{"v":11.2,"d":"11.20"}]
[{"$nulls":6},"*シルバーネット　７Ｘ１４  　Ｋ   ","垂直用１５㍉目合　橙",null,{"v":2,"d":"梱包数：2"},"*親綱・ネット・シート類","垂直ネット","WKY1343",{"v":19.6,"d":"19.60"}]
[{"$nulls":6},"*ネットブラケット　　　Ｋ   ","小幅ネット用　340～500",null,{"v":5,"d":"梱包数：5"},"*親綱・ネット・シート類","水平ネット","WKY0020",{"v":2.6,"d":"2.60"}]
[{"$nulls":6},"*親綱ロ－プ　６M　　Ｋ   ","１６φ　方フック付　白",null,{"v":15,"d":"梱包数：15"},"*親綱・ネット・シート類","親綱・安全ブロック","WKY0026",{"v":1.5,"d":"1.50"}]
[{"$nulls":6},"*親綱ロ－プ　８Ｍ　　Ｋ   ","１６φ　方フック付　緑",null,{"v":12,"d":"梱包数：12"},"*親綱・ネット・シート類","親綱・安全ブロック","WKY0027",{"v":1.8,"d":"1.80"}]
[{"$nulls":6},"*親綱ロ－プ　１０Ｍ　　Ｋ   ","１６φ　方フック付　黄",null,{"v":10,"d":"梱包数：10"},"*親綱・ネット・シート類","親綱・安全ブロック","WKY0021",{"v":2.2,"d":"2.20"}]
[{"$nulls":6},"*親綱ロ－プ　１２Ｍ　　Ｋ   ","１６φ　方フック付　橙",null,{"v":8,"d":"梱包数：8"},"*親綱・ネット・シート類","親綱・安全ブロック","WKY0022",{"v":2.4,"d":"2.40"}]
[{"$nulls":6},"*親綱ロ－プ　１５Ｍ　　Ｋ   ","１６φ　方フック付　青",null,{"v":8,"d":"梱包数：8"},"*親綱・ネット・シート類","親綱・安全ブロック","WKY0023",{"v":2.9,"d":"2.90"}]
[{"$nulls":6},"*親綱ロ－プ　２０Ｍ　　Ｋ   ","１６φ　方フック付　赤",null,{"v":6,"d":"梱包数：6"},"*親綱・ネット・シート類","親綱・安全ブロック","WKY0024",{"v":3.7,"d":"3.70"}]
[{"$nulls":6},"*親綱ロ－プ　３０Ｍ　　Ｋ   ","１６φ　方フック付　黒",null,{"v":4,"d":"梱包数：4"},"*親綱・ネット・シート類","親綱・安全ブロック","WKY0025",{"v":5.4,"d":"5.40"}]
[{"$nulls":6},"*キョーワロック　　Ｋ   ","親綱緊張器",null,{"v":10,"d":"梱包数：10"},"*親綱・ネット・シート類","親綱・安全ブロック","WKY0019",{"v":1.3,"d":"1.30"}]
[{"$nulls":6},"*キョーワピースクランプ　KY","鉄骨H柱用 親綱・安全ブロック設置金具",null,{"v":4,"d":"梱包数：4"},"*親綱・ネット・シート類","親綱・安全ブロック","WKY0135",0.85]
[{"$nulls":6},"*親綱支持用ベルト　３Ｍ　KY","D環付　ベルト巾50　有効長さ3000",null,{"v":2,"d":"梱包数：2"},"*親綱・ネット・シート類","親綱・安全ブロック","WKY0050",{"v":3,"d":"3.00"}]
[{"$nulls":6},"*ライトネスシルバー　１．８×５．１    KY   ","軽量メッシュシート",null,{"v":10,"d":"梱包数：10"},"*親綱・ネット・シート類","シート","WKY0034",{"v":3.2,"d":"3.20"}]
[{"$nulls":6},"*ライトネスシルバー　１．５×５．１    KY   ","軽量メッシュシート",null,{"v":5,"d":"梱包数：5"},"*親綱・ネット・シート類","シート","WKY0035",{"v":2.7,"d":"2.70"}]
[{"$nulls":6},"*ライトネスシルバー　１．２×５．１    KY   ","軽量メッシュシート",null,{"v":8,"d":"梱包数：8"},"*親綱・ネット・シート類","シート","WKY0036",2.25]
[{"$nulls":6},"*ライトネスシルバー　０．９×５．１    KY   ","軽量メッシュシート",null,{"v":10,"d":"梱包数：10"},"*親綱・ネット・シート類","シート","WKY0037",1.75]
[{"$nulls":6},"*ライトネスシルバー　０．６×５．１    KY   ","軽量メッシュシート",null,{"v":10,"d":"梱包数：10"},"*親綱・ネット・シート類","シート","WKY0038",1.25]
[{"$nulls":6},"*防炎養生シート　１．８×５．１    KY   ","Ⅱ類",null,{"v":5,"d":"梱包数：5"},"*親綱・ネット・シート類","シート","WKY2305",{"v":3.8,"d":"3.80"}]
[{"$nulls":6},"*防炎養生シート　１．５×５．１    KY   ","Ⅱ類",null,{"v":5,"d":"梱包数：5"},"*親綱・ネット・シート類","シート","WKY2304",{"v":3,"d":"3.00"}]
[{"$nulls":6},"*防炎養生シート　１．２×５．１    KY   ","Ⅱ類",null,{"v":5,"d":"梱包数：5"},"*親綱・ネット・シート類","シート","WKY2303",{"v":2.4,"d":"2.40"}]
[{"$nulls":6},"*防炎養生シート　０．９×５．１    KY   ","Ⅱ類",null,{"v":10,"d":"梱包数：10"},"*親綱・ネット・シート類","シート","WKY2302",{"v":1.9,"d":"1.90"}]
[{"$nulls":6},"*防炎養生シート　０．６×５．１    KY   ","Ⅱ類",null,{"v":10,"d":"梱包数：10"},"*親綱・ネット・シート類","シート","WKY2301",{"v":1.4,"d":"1.40"}]
[{"$nulls":6},"*軽量防音シート　１．８×３．４　Ｋ   ",null,null,{"v":4,"d":"梱包数：4"},"*親綱・ネット・シート類","シート","WKY2433",{"v":5.7,"d":"5.70"}]
[{"$nulls":6},"*軽量防音シート　１．５×３．４　Ｋ   ",null,null,{"v":4,"d":"梱包数：4"},"*親綱・ネット・シート類","シート","WKY2434",{"v":4.9,"d":"4.90"}]
[{"$nulls":6},"*軽量防音シート　１．２×３．４　Ｋ   ",null,null,{"v":5,"d":"梱包数：5"},"*親綱・ネット・シート類","シート","WKY2432",{"v":4,"d":"4.00"}]
[{"$nulls":6},"*軽量防音シート　０．９×３．４　Ｋ   ",null,null,{"v":8,"d":"梱包数：8"},"*親綱・ネット・シート類","シート","WKY2431",{"v":3.1,"d":"3.10"}]
[{"$nulls":6},"*軽量防音シート　０．６×３．４　Ｋ   ",null,null,{"v":10,"d":"梱包数：10"},"*親綱・ネット・シート類","シート","WKY2435",{"v":2.5,"d":"2.50"}]
[{"$nulls":6},"*安全ブロック(ベルトタイプ)６Ｍ　   ","※引寄せロープ　別途必要",null,{"v":1,"d":"梱包数：1"},"*親綱・ネット・シート類","親綱・安全ブロック","WKY0057",2.18]
[{"$nulls":6},"*安全ブロック用引寄せロープ　６Ｍ","安全ブロック(ベルトタイプ)6M用",{"$f":"I305","v":{"v":0,"d":"0 "}},"セット品","*親綱・ネット・シート類","親綱・安全ブロック","WKY0049"]
[{"$nulls":6},"*安全ブロック　１２Ｍ　Ｋ   ","（引寄せﾛｰﾌﾟ込)",null,{"v":1,"d":"梱包数：1"},"*親綱・ネット・シート類","親綱・安全ブロック","WKY0031",{"v":6,"d":"6.00"}]
[{"$nulls":6},"*安全ブロック　１５Ｍ　Ｋ   ","（引寄せﾛｰﾌﾟ込)",null,{"v":1,"d":"梱包数：1"},"*親綱・ネット・シート類","親綱・安全ブロック","WKY0032",{"v":7.5,"d":"7.50"}]
[{"$nulls":6},"*安全ブロック　２０Ｍ　Ｋ   ","（引寄せﾛｰﾌﾟ込)",null,{"v":1,"d":"梱包数：1"},"*親綱・ネット・シート類","親綱・安全ブロック","WKY0033",{"v":11,"d":"11.00"}]
[{"$nulls":6},"*親綱支柱　直交・平行兼用  KY","鋼製　斜形",null,{"v":2,"d":"梱包数：2"},"*親綱・ネット・シート類","親綱・安全ブロック","WKY0028",{"v":8.9,"d":"8.90"}]
[{"$nulls":6},"*吊りボックスパレット    KY   ","w1450　D1100　H1150",null,null,"*親綱・ネット・シート類","ボックスパレット","WKY0170",{"v":138,"d":"138.00"}]
[{"$nulls":6},"*ロリップ　　Ｋ   ","垂直用　",null,{"v":10,"d":"梱包数：10"},"*親綱・ネット・シート類","親綱・安全ブロック","WKY0030",{"v":1,"d":"1.00"}]
[{"$nulls":6},"*キョーワクランプ（ネット用クランプ）KY","ネット用",null,{"v":20,"d":"梱包数：20"},"*親綱・ネット・シート類","水平ネット","WKY0111",0.63]
[{"$nulls":6},"*キョーワハンガー K（メッシュ用ハンガー）","シート用クランプ",null,{"v":40,"d":"梱包数：40"},"*親綱・ネット・シート類","シート","WKY0018",{"v":0.4,"d":"0.40"}]
[{"$nulls":6},"*結束ひも   KY （参考：1本／平米）","50㎝　100本単位販売品",null,null,"*親綱・ネット・シート類","水平ネット","WKY0102",0.01]
[{"$nulls":6},"*ＰＰロープ   KY （参考：25本／1枚）","62㎝　100本単位販売品",null,null,"*親綱・ネット・シート類","シート","WKY0101",0.01]
[{"$nulls":6},"*プラワンゲート　UI　単管足場用伸縮開口扉","H600～1000　W600",null,null,"*単管足場用開口扉","単管足場用開口扉","WUI0010",{"v":7,"d":"7.00"}]
[{"$nulls":6},"*アルウォーク　丸バタ(48.6φ単管)用","W650　H1040　 垂直～1割勾配",null,null,"*キャットウォーク","自在式足場ブラケット","WHN0001",{"v":5.3,"d":"5.30"}]
[{"$nulls":6},"*アルウォーク　角バタ(60角バタ)用","W650　H1040　 垂直～1割勾配",null,null,"*キャットウォーク","自在式足場ブラケット","WHN0002",{"v":5.4,"d":"5.40"}]
[{"$nulls":6},"*アルウォーク　フック無　※アンカー別途必要","W650　H1040　 垂直～1割勾配",null,null,"*キャットウォーク","自在式足場ブラケット","WHN0003",{"v":4.3,"d":"4.30"}]
[{"$nulls":6},"*ラバーベース　大　□140用　販売品","ジャッキベース用 （50枚入）",null,{"v":50,"d":"梱包数：50"},"*単管キャップ・クランプカバーなど","販売品","WAO0002",0.09]
[{"$nulls":6},"*ラバーベース　小　□120用　販売品","固定ベース用（50枚入）",null,{"v":50,"d":"梱包数：50"},"*単管キャップ・クランプカバーなど","販売品","WAO0005",0.07]
[{"$nulls":6},"*単管ゴムキャップ（黒）AO　販売品","φ48.6用（100個入）",null,{"v":100,"d":"梱包数：100"},"*単管キャップ・クランプカバーなど","販売品","WAO0012",0.15]
[{"$nulls":6},"*単管パイプ用エコキャッピカ　ＡＯ　販売品","φ48.6単管、鉄筋D19～D25兼用（200個入）",null,{"v":200,"d":"梱包数：200"},"*単管キャップ・クランプカバーなど","販売品","WAO0015",0.17]
[{"$nulls":6},"*クランプ用ソフトカバー　ＡＯ　販売品","黄（100個入）",null,{"v":100,"d":"梱包数：100"},"*単管キャップ・クランプカバーなど","販売品","WAO0016",0.04]
[{"$nulls":6},"*単管パイプ用　ハイキャップF型　販売品","黄・青・緑（200個入）",null,{"v":200,"d":"梱包数：200"},"*単管キャップ・クランプカバーなど","販売品","XAT0019",{"v":0.112,"d":"0.11"}]
[{"$nulls":6},"*ダブルロックパイプ専用　TT-CAP　OD　販売品","φ48.6用（100個入）",null,{"v":100,"d":"梱包数：100"},"*単管キャップ・クランプカバーなど","販売品","XAT6530",{"v":0.2,"d":"0.20"}]
[{"$nulls":6},"*単管バリケード　プラスチック","Ｗ635　Ｈ820",null,null,"*単管用プラガード","単管用プラガード","WET0021",{"v":2.1,"d":"2.10"}]
[{"$nulls":6},"*単管おもし",{"$nulls":3},"*単管用プラガード","単管用プラガード","WET0023",{"v":8,"d":"8.00"}]
[{"$nulls":6},"*ＰＰロープ   KY （参考：1本／平米）","62㎝　100本単位販売品",null,null,"*親綱・ネット・シート類","垂直ネット","WKY0101",0.01]

{"sheet":"発注シート（送付用）","index":1,"n_rows":38,"n_cols":22,"rows_kept":38,"merged":[[0,1,1,12],[0,13,1,17],[2,1,2,17],[3,1,3,3],[3,4,3,9],[3,10,3,12],[3,13,3,16],[3,19,3,22],[4,1,4,3],[4,4,4,9],[4,10,4,12],[4,13,4,17],[4,19,4,22],[5,1,5,3],[5,4,5,9],[5,10,5,12],[5,13,5,17],[5,19,5,22],[6,1,6,3],[6,4,6,9],[6,10,6,12],[6,13,6,17],[6,19,6,20],[7,1,7,3],[7,4,7,11],[7,13,7,14],[7,15,7,16],[7,19,7,22],[8,1,8,3],[8,4,8,9],[8,10,8,17],[8,19,8,22],[9,1,9,17],[10,1,10,17],[11,1,11,17],[12,1,12,17],[13,2,13,6],[13,7,13,8],[13,11,13,15],[13,16,13,17],[14,2,14,6],[14,7,14,8],[14,11,14,15],[14,16,14,17],[15,2,15,6],[15,7,15,8],[15,11,15,15],[15,16,15,17],[16,2,16,6],[16,7,16,8],[16,11,16,15],[16,16,16,17],[17,2,17,6],[17,7,17,8],[17,11,17,15],[17,16,17,17],[18,2,18,6],[18,7,18,8],[18,11,18,15],[18,16,18,17],[19,2,19,6],[19,7,19,8],[19,11,19,15],[19,16,19,17],[20,2,20,6],[20,7,20,8],[20,11,20,15],[20,16,20,17],[21,2,21,6],[21,7,21,8],[21,11,21,15],[21,16,21,17],[22,2,22,6],[22,7,22,8],[22,11,22,15],[22,16,22,17],[23,2,23,6],[23,7,23,8],[23,11,23,15],[23,16,23,17],[24,2,24,6],[24,7,24,8],[24,11,24,15],[24,16,24,17],[25,2,25,6],[25,7,25,8],[25,11,25,15],[25,16,25,17],[26,2,26,6],[26,7,26,8],[26,11,26,15],[26,16,26,17],[27,2,27,6],[27,7,27,8],[27,11,27,15],[27,16,27,17],[28,2,28,6],[28,7,28,8],[28,11,28,15],[28,16,28,17],[29,2,29,6],[29,7,29,8],[29,11,29,15],[29,16,29,17],[30,2,30,6],[30,7,30,8],[30,11,30,15],[30,16,30,17],[31,2,31,6],[31,7,31,8],[31,11,31,15],[31,16,31,17],[32,2,32,6],[32,7,32,8],[32,11,32,15],[32,16,32,17],[33,2,33,6],[33,7,33,8],[33,11,33,15],[33,16,33,17],[34,2,34,6],[34,7,34,8],[34,11,34,15],[34,16,34,17],[35,2,35,6],[35,7,35,8],[35,11,35,15],[35,16,35,17],[36,2,36,6],[36,7,36,8],[36,11,36,15],[36,16,36,17],[37,2,37,6],[37,7,37,8],[37,11,37,15],[37,16,37,17]]}
[null,"青 森 ア ト ム 宛　資 材 発 注 書",{"$nulls":11},{"$f":"NOW()","v":"2025-04-14T10:12:45.750"}]
[]
[null,"下記入力内容をご確認の上、メールかFaxで送付をお願いします。　"]
[null,"会社名",{"$nulls":8},"納入希望日",{"$nulls":6},{"$f":"TEXT(N4,\"（aaa）;；\")","v":""},null,{"$f":"IFERROR(IF(休業日!X5=\"*\",休業日!Y5&休業日!Y6,\"\"),\"\")","v":""}]
[null,"現場名",{"$nulls":8},"納入希望時間\n8:00～16:00",{"$nulls":8},{"$f":"休業日!Y4","v":""}]
[null,"発注者",{"$nulls":8},"納入方法",{"$nulls":8},{"$f":"IF(N6=\"配 達 希 望\",休業日!Y7,\"\")","v":""}]
[null,"連絡先電話",{"$nulls":8},"車　種",{"$nulls":8},{"$f":"IF('発注シート（送付用）'!Q38>30,\"マルチパレットの使用をお勧めします。 概算必要数➡\",\"\")","v":""},null,{"$f":"休業日!W2","v":""}]
[null,"メールでの発注は",null,null,"　order-am-atom@am-atom.jp ",{"$nulls":8},"資材重量",null,{"$f":"休業日!T1","v":{"v":0,"d":"0.0"}},null,"ｔ",null,{"$f":"休業日!X25","v":""}]
[null,"Faxでの発注は",null,null,"　0 1 7 5 - 4 5 - 7 7 5 1",{"$nulls":5},"※資材の嵩により積載重量以下でも全数を積めない場合があります。",{"$nulls":8},{"$f":"休業日!X26","v":0}]
[null,"【注意事項や伝達事項などがございましたらご記入ください。】　例.納入場所、受取者、申請必要…"]
[]
[]
[]
[null,{"$f":"VLOOKUP(1,休業日!$K$2:$N$298,1,FALSE)","v":1},{"$f":"VLOOKUP(B14,休業日!$K$2:$N$999,2,FALSE)","v":""},{"$nulls":4},{"$f":"VLOOKUP(B14,休業日!$K$2:$N$999,4,FALSE)","v":""},null,null,{"$f":"VLOOKUP(26,休業日!$K$2:$N$298,1,FALSE)","v":26},{"$f":"VLOOKUP(K14,休業日!$K$2:$N$999,2,FALSE)","v":""},{"$nulls":4},{"$f":"VLOOKUP(K14,休業日!$K$2:$N$298,4,FALSE)","v":""}]
[null,{"$f":"VLOOKUP(2,休業日!$K$2:$N$298,1,FALSE)","v":2},{"$f":"VLOOKUP(B15,休業日!$K$2:$N$999,2,FALSE)","v":""},{"$nulls":4},{"$f":"VLOOKUP(B15,休業日!$K$2:$N$999,4,FALSE)","v":""},null,null,{"$f":"VLOOKUP(27,休業日!$K$2:$N$298,1,FALSE)","v":27},{"$f":"VLOOKUP(K15,休業日!$K$2:$N$999,2,FALSE)","v":""},{"$nulls":4},{"$f":"VLOOKUP(K15,休業日!$K$2:$N$298,4,FALSE)","v":""}]
[null,{"$f":"VLOOKUP(3,休業日!$K$2:$N$298,1,FALSE)","v":3},{"$f":"VLOOKUP(B16,休業日!$K$2:$N$999,2,FALSE)","v":""},{"$nulls":4},{"$f":"VLOOKUP(B16,休業日!$K$2:$N$999,4,FALSE)","v":""},null,null,{"$f":"VLOOKUP(28,休業日!$K$2:$N$298,1,FALSE)","v":28},{"$f":"VLOOKUP(K16,休業日!$K$2:$N$999,2,FALSE)","v":""},{"$nulls":4},{"$f":"VLOOKUP(K16,休業日!$K$2:$N$298,4,FALSE)","v":""}]
[null,{"$f":"VLOOKUP(4,休業日!$K$2:$N$298,1,FALSE)","v":4},{"$f":"VLOOKUP(B17,休業日!$K$2:$N$999,2,FALSE)","v":""},{"$nulls":4},{"$f":"VLOOKUP(B17,休業日!$K$2:$N$999,4,FALSE)","v":""},null,null,{"$f":"VLOOKUP(29,休業日!$K$2:$N$298,1,FALSE)","v":29},{"$f":"VLOOKUP(K17,休業日!$K$2:$N$999,2,FALSE)","v":""},{"$nulls":4},{"$f":"VLOOKUP(K17,休業日!$K$2:$N$298,4,FALSE)","v":""}]
[null,{"$f":"VLOOKUP(5,休業日!$K$2:$N$298,1,FALSE)","v":5},{"$f":"VLOOKUP(B18,休業日!$K$2:$N$999,2,FALSE)","v":""},{"$nulls":4},{"$f":"VLOOKUP(B18,休業日!$K$2:$N$999,4,FALSE)","v":""},null,null,{"$f":"VLOOKUP(30,休業日!$K$2:$N$298,1,FALSE)","v":30},{"$f":"VLOOKUP(K18,休業日!$K$2:$N$999,2,FALSE)","v":""},{"$nulls":4},{"$f":"VLOOKUP(K18,休業日!$K$2:$N$298,4,FALSE)","v":""}]
[null,{"$f":"VLOOKUP(6,休業日!$K$2:$N$298,1,FALSE)","v":6},{"$f":"VLOOKUP(B19,休業日!$K$2:$N$999,2,FALSE)","v":""},{"$nulls":4},{"$f":"VLOOKUP(B19,休業日!$K$2:$N$999,4,FALSE)","v":""},null,null,{"$f":"VLOOKUP(31,休業日!$K$2:$N$298,1,FALSE)","v":31},{"$f":"VLOOKUP(K19,休業日!$K$2:$N$999,2,FALSE)","v":""},{"$nulls":4},{"$f":"VLOOKUP(K19,休業日!$K$2:$N$298,4,FALSE)","v":""}]
[null,{"$f":"VLOOKUP(7,休業日!$K$2:$N$298,1,FALSE)","v":7},{"$f":"VLOOKUP(B20,休業日!$K$2:$N$999,2,FALSE)","v":""},{"$nulls":4},{"$f":"VLOOKUP(B20,休業日!$K$2:$N$999,4,FALSE)","v":""},null,null,{"$f":"VLOOKUP(32,休業日!$K$2:$N$298,1,FALSE)","v":32},{"$f":"VLOOKUP(K20,休業日!$K$2:$N$999,2,FALSE)","v":""},{"$nulls":4},{"$f":"VLOOKUP(K20,休業日!$K$2:$N$298,4,FALSE)","v":""}]
[null,{"$f":"VLOOKUP(8,休業日!$K$2:$N$298,1,FALSE)","v":8},{"$f":"VLOOKUP(B21,休業日!$K$2:$N$999,2,FALSE)","v":""},{"$nulls":4},{"$f":"VLOOKUP(B21,休業日!$K$2:$N$999,4,FALSE)","v":""},null,null,{"$f":"VLOOKUP(33,休業日!$K$2:$N$298,1,FALSE)","v":33},{"$f":"VLOOKUP(K21,休業日!$K$2:$N$999,2,FALSE)","v":""},{"$nulls":4},{"$f":"VLOOKUP(K21,休業日!$K$2:$N$298,4,FALSE)","v":""}]
[null,{"$f":"VLOOKUP(9,休業日!$K$2:$N$298,1,FALSE)","v":9},{"$f":"VLOOKUP(B22,休業日!$K$2:$N$999,2,FALSE)","v":""},{"$nulls":4},{"$f":"VLOOKUP(B22,休業日!$K$2:$N$999,4,FALSE)","v":""},null,null,{"$f":"VLOOKUP(34,休業日!$K$2:$N$298,1,FALSE)","v":34},{"$f":"VLOOKUP(K22,休業日!$K$2:$N$999,2,FALSE)","v":""},{"$nulls":4},{"$f":"VLOOKUP(K22,休業日!$K$2:$N$298,4,FALSE)","v":""}]
[null,{"$f":"VLOOKUP(10,休業日!$K$2:$N$298,1,FALSE)","v":10},{"$f":"VLOOKUP(B23,休業日!$K$2:$N$999,2,FALSE)","v":""},{"$nulls":4},{"$f":"VLOOKUP(B23,休業日!$K$2:$N$999,4,FALSE)","v":""},null,null,{"$f":"VLOOKUP(35,休業日!$K$2:$N$298,1,FALSE)","v":35},{"$f":"VLOOKUP(K23,休業日!$K$2:$N$999,2,FALSE)","v":""},{"$nulls":4},{"$f":"VLOOKUP(K23,休業日!$K$2:$N$298,4,FALSE)","v":""}]
[null,{"$f":"VLOOKUP(11,休業日!$K$2:$N$298,1,FALSE)","v":11},{"$f":"VLOOKUP(B24,休業日!$K$2:$N$999,2,FALSE)","v":""},{"$nulls":4},{"$f":"VLOOKUP(B24,休業日!$K$2:$N$999,4,FALSE)","v":""},null,null,{"$f":"VLOOKUP(36,休業日!$K$2:$N$298,1,FALSE)","v":36},{"$f":"VLOOKUP(K24,休業日!$K$2:$N$999,2,FALSE)","v":""},{"$nulls":4},{"$f":"VLOOKUP(K24,休業日!$K$2:$N$298,4,FALSE)","v":""}]
[null,{"$f":"VLOOKUP(12,休業日!$K$2:$N$298,1,FALSE)","v":12},{"$f":"VLOOKUP(B25,休業日!$K$2:$N$999,2,FALSE)","v":""},{"$nulls":4},{"$f":"VLOOKUP(B25,休業日!$K$2:$N$999,4,FALSE)","v":""},null,null,{"$f":"VLOOKUP(37,休業日!$K$2:$N$298,1,FALSE)","v":37},{"$f":"VLOOKUP(K25,休業日!$K$2:$N$999,2,FALSE)","v":""},{"$nulls":4},{"$f":"VLOOKUP(K25,休業日!$K$2:$N$298,4,FALSE)","v":""}]
[null,{"$f":"VLOOKUP(13,休業日!$K$2:$N$298,1,FALSE)","v":13},{"$f":"VLOOKUP(B26,休業日!$K$2:$N$999,2,FALSE)","v":""},{"$nulls":4},{"$f":"VLOOKUP(B26,休業日!$K$2:$N$999,4,FALSE)","v":""},null,null,{"$f":"VLOOKUP(38,休業日!$K$2:$N$298,1,FALSE)","v":38},{"$f":"VLOOKUP(K26,休業日!$K$2:$N$999,2,FALSE)","v":""},{"$nulls":4},{"$f":"VLOOKUP(K26,休業日!$K$2:$N$298,4,FALSE)","v":""}]
[null,{"$f":"VLOOKUP(14,休業日!$K$2:$N$298,1,FALSE)","v":14},{"$f":"VLOOKUP(B27,休業日!$K$2:$N$999,2,FALSE)","v":""},{"$nulls":4},{"$f":"VLOOKUP(B27,休業日!$K$2:$N$999,4,FALSE)","v":""},null,null,{"$f":"VLOOKUP(39,休業日!$K$2:$N$298,1,FALSE)","v":39},{"$f":"VLOOKUP(K27,休業日!$K$2:$N$999,2,FALSE)","v":""},{"$nulls":4},{"$f":"VLOOKUP(K27,休業日!$K$2:$N$298,4,FALSE)","v":""}]
[null,{"$f":"VLOOKUP(15,休業日!$K$2:$N$298,1,FALSE)","v":15},{"$f":"VLOOKUP(B28,休業日!$K$2:$N$999,2,FALSE)","v":""},{"$nulls":4},{"$f":"VLOOKUP(B28,休業日!$K$2:$N$999,4,FALSE)","v":""},null,null,{"$f":"VLOOKUP(40,休業日!$K$2:$N$298,1,FALSE)","v":40},{"$f":"VLOOKUP(K28,休業日!$K$2:$N$999,2,FALSE)","v":""},{"$nulls":4},{"$f":"VLOOKUP(K28,休業日!$K$2:$N$298,4,FALSE)","v":""}]
[null,{"$f":"VLOOKUP(16,休業日!$K$2:$N$298,1,FALSE)","v":16},{"$f":"VLOOKUP(B29,休業日!$K$2:$N$999,2,FALSE)","v":""},{"$nulls":4},{"$f":"VLOOKUP(B29,休業日!$K$2:$N$999,4,FALSE)","v":""},null,null,{"$f":"VLOOKUP(41,休業日!$K$2:$N$298,1,FALSE)","v":41},{"$f":"VLOOKUP(K29,休業日!$K$2:$N$999,2,FALSE)","v":""},{"$nulls":4},{"$f":"VLOOKUP(K29,休業日!$K$2:$N$298,4,FALSE)","v":""}]
[null,{"$f":"VLOOKUP(17,休業日!$K$2:$N$298,1,FALSE)","v":17},{"$f":"VLOOKUP(B30,休業日!$K$2:$N$999,2,FALSE)","v":""},{"$nulls":4},{"$f":"VLOOKUP(B30,休業日!$K$2:$N$999,4,FALSE)","v":""},null,null,{"$f":"VLOOKUP(42,休業日!$K$2:$N$298,1,FALSE)","v":42},{"$f":"VLOOKUP(K30,休業日!$K$2:$N$999,2,FALSE)","v":""},{"$nulls":4},{"$f":"VLOOKUP(K30,休業日!$K$2:$N$298,4,FALSE)","v":""}]
[null,{"$f":"VLOOKUP(18,休業日!$K$2:$N$298,1,FALSE)","v":18},{"$f":"VLOOKUP(B31,休業日!$K$2:$N$999,2,FALSE)","v":""},{"$nulls":4},{"$f":"VLOOKUP(B31,休業日!$K$2:$N$999,4,FALSE)","v":""},null,null,{"$f":"VLOOKUP(43,休業日!$K$2:$N$298,1,FALSE)","v":43},{"$f":"VLOOKUP(K31,休業日!$K$2:$N$999,2,FALSE)","v":""},{"$nulls":4},{"$f":"VLOOKUP(K31,休業日!$K$2:$N$298,4,FALSE)","v":""}]
[null,{"$f":"VLOOKUP(19,休業日!$K$2:$N$298,1,FALSE)","v":19},{"$f":"VLOOKUP(B32,休業日!$K$2:$N$999,2,FALSE)","v":""},{"$nulls":4},{"$f":"VLOOKUP(B32,休業日!$K$2:$N$999,4,FALSE)","v":""},null,null,{"$f":"VLOOKUP(44,休業日!$K$2:$N$298,1,FALSE)","v":44},{"$f":"VLOOKUP(K32,休業日!$K$2:$N$999,2,FALSE)","v":""},{"$nulls":4},{"$f":"VLOOKUP(K32,休業日!$K$2:$N$298,4,FALSE)","v":""}]
[null,{"$f":"VLOOKUP(20,休業日!$K$2:$N$298,1,FALSE)","v":20},{"$f":"VLOOKUP(B33,休業日!$K$2:$N$999,2,FALSE)","v":""},{"$nulls":4},{"$f":"VLOOKUP(B33,休業日!$K$2:$N$999,4,FALSE)","v":""},null,null,{"$f":"VLOOKUP(45,休業日!$K$2:$N$298,1,FALSE)","v":45},{"$f":"VLOOKUP(K33,休業日!$K$2:$N$999,2,FALSE)","v":""},{"$nulls":4},{"$f":"VLOOKUP(K33,休業日!$K$2:$N$298,4,FALSE)","v":""}]
[null,{"$f":"VLOOKUP(21,休業日!$K$2:$N$298,1,FALSE)","v":21},{"$f":"VLOOKUP(B34,休業日!$K$2:$N$999,2,FALSE)","v":""},{"$nulls":4},{"$f":"VLOOKUP(B34,休業日!$K$2:$N$999,4,FALSE)","v":""},null,null,{"$f":"VLOOKUP(46,休業日!$K$2:$N$298,1,FALSE)","v":46},{"$f":"VLOOKUP(K34,休業日!$K$2:$N$999,2,FALSE)","v":""},{"$nulls":4},{"$f":"VLOOKUP(K34,休業日!$K$2:$N$298,4,FALSE)","v":""}]
[null,{"$f":"VLOOKUP(22,休業日!$K$2:$N$298,1,FALSE)","v":22},{"$f":"VLOOKUP(B35,休業日!$K$2:$N$999,2,FALSE)","v":""},{"$nulls":4},{"$f":"VLOOKUP(B35,休業日!$K$2:$N$999,4,FALSE)","v":""},null,null,{"$f":"VLOOKUP(47,休業日!$K$2:$N$298,1,FALSE)","v":47},{"$f":"VLOOKUP(K35,休業日!$K$2:$N$999,2,FALSE)","v":""},{"$nulls":4},{"$f":"VLOOKUP(K35,休業日!$K$2:$N$298,4,FALSE)","v":""}]
[null,{"$f":"VLOOKUP(23,休業日!$K$2:$N$298,1,FALSE)","v":23},{"$f":"VLOOKUP(B36,休業日!$K$2:$N$999,2,FALSE)","v":""},{"$nulls":4},{"$f":"VLOOKUP(B36,休業日!$K$2:$N$999,4,FALSE)","v":""},null,null,{"$f":"VLOOKUP(48,休業日!$K$2:$N$298,1,FALSE)","v":48},{"$f":"VLOOKUP(K36,休業日!$K$2:$N$999,2,FALSE)","v":""},{"$nulls":4},{"$f":"VLOOKUP(K36,休業日!$K$2:$N$298,4,FALSE)","v":""}]
[null,{"$f":"VLOOKUP(24,休業日!$K$2:$N$298,1,FALSE)","v":24},{"$f":"VLOOKUP(B37,休業日!$K$2:$N$999,2,FALSE)","v":""},{"$nulls":4},{"$f":"VLOOKUP(B37,休業日!$K$2:$N$999,4,FALSE)","v":""},null,null,{"$f":"VLOOKUP(49,休業日!$K$2:$N$298,1,FALSE)","v":49},{"$f":"VLOOKUP(K37,休業日!$K$2:$N$999,2,FALSE)","v":""},{"$nulls":4},{"$f":"VLOOKUP(K37,休業日!$K$2:$N$298,4,FALSE)","v":""}]
[null,{"$f":"VLOOKUP(25,休業日!$K$2:$N$298,1,FALSE)","v":25},{"$f":"VLOOKUP(B38,休業日!$K$2:$N$999,2,FALSE)","v":""},{"$nulls":4},{"$f":"VLOOKUP(B38,休業日!$K$2:$N$999,4,FALSE)","v":""},{"$nulls":3},"土のう袋",{"$nulls":4},{"$f":"休業日!V1","v":{"v":0,"d":"0 "}}]

{"sheet":"休業日","index":2,"n_rows":397,"n_cols":30,"rows_kept":397}
[null,null,"機材名","備考","注文数","品　目","分類","コード","重量","土のう袋",{"$nulls":5},{"$f":"IF(Q1=\"\",\"\",1)","v":""},{"$f":"IF(F1=\"*\",H1,\"\")","v":""},{"$f":"IF(F1=\"*\",I1,\"\")","v":""},{"$f":"IF(F1=\"*\",J1,0)","v":{"v":0,"d":"0 "}},{"$f":"SUM(T2:T584)*0.001","v":{"v":0,"d":"0.0"}},{"$f":"IF(G1=\"*\",K1,0)","v":{"v":0,"d":"0 "}},{"$f":"SUM(V2:V228)","v":{"v":0,"d":"0 "}},{"$f":"ROUNDUP(V1/30,0)","v":0},{"$f":"TEXT(X3,\"aaa\")","v":"土"},{"$nulls":3},"青森アトム　休業日"]
[{"$f":"IF(B2=\"\",\"\",(COUNTIF($B$2:B2,B2)))","v":""},{"$f":"IF(E2,\"1\",\"\")","v":""},"Ｉｑ支柱３８００","H3800 φ48.6",{"$f":"入力!I5","v":0},"　Iｑシステム","Iq支柱","IQA3800",{"v":11.7,"d":"11.70"},null,1,{"$f":"IFERROR(VLOOKUP(K2,$A$2:$E$999,3,FALSE),\"\")","v":""},{"$f":"IFERROR(VLOOKUP(K2,$A$2:$E$99,4,FALSE),\"\")","v":""},{"$f":"IFERROR(VLOOKUP(K2,$A$2:$E$499,5,FALSE),\"\")","v":""},null,{"$f":"IF(E2=\"0\",\"\",H2)","v":"IQA3800"},{"$f":"IF(E2=\"0\",\"\",C2)","v":"Ｉｑ支柱３８００"},{"$f":"IF(E2=\"\",\"\",E2)","v":{"v":0,"d":"0 "}},{"$f":"IF(E2=\"\",0,I2)","v":{"v":11.7,"d":"12 "}},{"$f":"R2*S2","v":{"v":0,"d":"0 "}},{"$f":"IF(E2=\"0\",\"\",J2)","v":{"v":0,"d":"0 "}},null,{"$f":"IF(W1=0,\"\",W1)","v":""},{"$f":"'発注シート（送付用）'!N1","v":"2025-04-14T10:12:45.750"},null,{"$f":"AB2","v":45748},{"$f":"IF(AD2=\"\",\"\",\"*\")","v":""},"2025-04-01",{"$f":"TEXT(AB2,\"aaa\")","v":"火"}]
[{"$f":"IF(B3=\"\",\"\",(COUNTIF($B$2:B3,B3)))","v":""},{"$f":"IF(E3,\"1\",\"\")","v":""},"Ｉｑ支柱１９００【青】","H1900 φ48.6",{"$f":"入力!I6","v":0},"　Iｑシステム","Iq支柱","IQA1900",{"v":6.2,"d":"6.20"},null,2,"","","",null,{"$f":"IF(E3=\"0\",\"\",H3)","v":"IQA1900"},"Ｉｑ支柱１９００【青】",{"$f":"IF(E3=\"\",\"\",E3)","v":{"v":0,"d":"0 "}},{"$f":"IF(E3=\"\",0,I3)","v":{"v":6.2,"d":"6 "}},{"$f":"R3*S3","v":{"v":0,"d":"0 "}},{"v":0,"d":"0 "},null,null,{"$f":"'発注シート（送付用）'!N4+'発注シート（送付用）'!N5","v":"00:00:00"},{"$f":"IFERROR(VLOOKUP(Z1,Z1:AD500,5,FALSE),0)","v":0},{"$f":"AB3","v":45749},{"$f":"IF(AD3=\"\",\"\",\"*\")","v":""},{"$f":"AB2+1","v":"2025-04-02"},"水"]
[{"$f":"IF(B4=\"\",\"\",(COUNTIF($B$2:B4,B4)))","v":""},"","Ｉｑ支柱１４２５【黄】","H1425 φ48.6",{"$f":"入力!I7","v":0},"　Iｑシステム","Iq支柱","IQA1425",{"v":4.8,"d":"4.80"},null,3,"","","",null,"IQA1425","Ｉｑ支柱１４２５【黄】",{"v":0,"d":"0 "},{"v":4.8,"d":"5 "},{"v":0,"d":"0 "},{"v":0,"d":"0 "},null,null,{"$f":"IF(X3-X2<0,\"\",X3-X2)","v":""},{"$f":"IF(X4<1,\"午前お引取りの発注は前日の午前中までに、午後お引取りの発注は前日の営業時間内に、ご協力をお願いします。\",\"\")","v":""},45750,"",{"$f":"AB3+1","v":"2025-04-03"},"木"]
[{"$f":"IF(B5=\"\",\"\",(COUNTIF($B$2:B5,B5)))","v":""},"","Ｉｑ支柱９５０【ピンク】","H950 φ48.6",{"$f":"入力!I8","v":0},"　Iｑシステム","Iq支柱","IQA950",{"v":3.4,"d":"3.40"},null,4,"","","",null,"IQA950","Ｉｑ支柱９５０【ピンク】",{"v":0,"d":"0 "},{"v":3.4,"d":"3 "},{"v":0,"d":"0 "},{"v":0,"d":"0 "},null,null,{"$f":"VLOOKUP('発注シート（送付用）'!N4,Z2:AA366,2,TRUE)","v":{"$error":"#N/A"}},{"$f":"IFERROR(VLOOKUP(X3,AB2:AD366,3,TRUE),\"\")","v":""},45751,"","2025-04-04","金"]
[{"$f":"IF(B6=\"\",\"\",(COUNTIF($B$2:B6,B6)))","v":""},"","Ｉｑ支柱４７５【黄緑】","H475 φ48.6",{"$f":"入力!I9","v":0},"　Iｑシステム","Iq支柱","IQA475",{"v":2.1,"d":"2.10"},null,5,"","","",null,"IQA475","Ｉｑ支柱４７５【黄緑】",{"v":0,"d":"0 "},{"v":2.1,"d":"2 "},{"v":0,"d":"0 "},{"v":0,"d":"0 "},{"$nulls":3},"ですので、ご注意願います。",45752,"*","2025-04-05","土","休業日"]
[{"$f":"IF(B7=\"\",\"\",(COUNTIF($B$2:B7,B7)))","v":""},"","Ｉｑ下部支柱２７５０Ａ　","最下段用 H2750",{"$f":"入力!I10","v":0},"　Iｑシステム","Iq支柱","IQA2750A",{"v":8.8,"d":"8.80"},null,6,"","","",null,"IQA2750A","Ｉｑ下部支柱２７５０Ａ　",{"v":0,"d":"0 "},{"v":8.8,"d":"9 "},{"v":0,"d":"0 "},{"v":0,"d":"0 "},null,null,{"$f":"IF('発注シート（送付用）'!N6=\"配 達 希 望\",1,0)","v":{"v":0,"d":"0 "}},{"$f":"IF(X4+X7<2,\"車両手配（配達希望）の場合は、営業日2日前までにご依頼をお願いします。\",\"\")","v":{"$error":"#VALUE!"}},45753,"*","2025-04-06","日","休業日"]
[{"$f":"IF(B8=\"\",\"\",(COUNTIF($B$2:B8,B8)))","v":""},"","Ｉｑ下部支柱１４２５Ａ【スカイブルー】","最下段用 H1425",{"$f":"入力!I11","v":0},"　Iｑシステム","Iq支柱","IQA1425A",{"v":4.9,"d":"4.90"},null,7,"","","",null,"IQA1425A","Ｉｑ下部支柱１４２５Ａ【スカイブルー】",{"v":0,"d":"0 "},{"v":4.9,"d":"5 "},{"v":0,"d":"0 "},{"v":0,"d":"0 "},null,null,{"$f":"'発注シート（送付用）'!N7","v":0},{"$f":"IF(T1>X12,\"積載重量超過！　発注数量の調整をお願いします。\",\"\")","v":""},45754,"","2025-04-07","月"]
[{"$f":"IF(B9=\"\",\"\",(COUNTIF($B$2:B9,B9)))","v":""},"","Ｉｑ下部支柱９５０Ａ　【オレンジ】","最下段用 H950",{"$f":"入力!I12","v":0},"　Iｑシステム","Iq支柱","IQA950A",{"v":3.4,"d":"3.40"},null,8,"","","",null,"IQA950A","Ｉｑ下部支柱９５０Ａ　【オレンジ】",{"v":0,"d":"0 "},{"v":3.4,"d":"3 "},{"v":0,"d":"0 "},{"v":0,"d":"0 "},null,null,2.4,null,45755,"","2025-04-08","火"]
[{"$f":"IF(B10=\"\",\"\",(COUNTIF($B$2:B10,B10)))","v":""},"","Ｉｑ下部支柱４７５Ａ【緑】　","最下段用 H475",{"$f":"入力!I13","v":0},"　Iｑシステム","Iq支柱","IQA475A",{"v":2.1,"d":"2.10"},null,9,"","","",null,"IQA475A","Ｉｑ下部支柱４７５Ａ【緑】　",{"v":0,"d":"0 "},{"v":2.1,"d":"2 "},{"v":0,"d":"0 "},{"v":0,"d":"0 "},null,null,9,null,45756,"","2025-04-09","水"]
[{"$f":"IF(B11=\"\",\"\",(COUNTIF($B$2:B11,B11)))","v":""},"","Ｉｑ下部支柱２３８Ａ　","最下段用 H238",{"$f":"入力!I14","v":0},"　Iｑシステム","Iq支柱","IQA238A",{"v":1.4,"d":"1.40"},null,10,"","","",null,"IQA238A","Ｉｑ下部支柱２３８Ａ　",{"v":0,"d":"0 "},{"v":1.4,"d":"1 "},{"v":0,"d":"0 "},{"v":0,"d":"0 "},null,null,10,null,45757,"","2025-04-10","木"]
[{"$f":"IF(B12=\"\",\"\",(COUNTIF($B$2:B12,B12)))","v":""},"","Ｉｑヘッド支柱９５０【黒】","ステージ用　Ｈ950",{"$f":"入力!I15","v":0},"　Iｑシステム","Iq支柱","IQA950H",{"v":3,"d":"3.00"},null,11,"","","",null,"IQA950H","Ｉｑヘッド支柱９５０【黒】",{"v":0,"d":"0 "},{"v":3,"d":"3 "},{"v":0,"d":"0 "},{"v":0,"d":"0 "},null,null,{"$f":"IF(X8=\"増ｔユニック(積載9ｔ)\",9,IF(X8=\"増ｔ平車(積載10ｔ)\",10,2.4))","v":2.4},null,45758,"","2025-04-11","金"]
[{"$f":"IF(B13=\"\",\"\",(COUNTIF($B$2:B13,B13)))","v":""},"","Ｉｑヘッド支柱６００【紫】","支保工用　Ｈ600",{"$f":"入力!I16","v":0},"　Iｑシステム","Iq支柱","IQA600H",{"v":1.8,"d":"1.80"},null,12,"","","",null,"IQA600H","Ｉｑヘッド支柱６００【紫】",{"v":0,"d":"0 "},{"v":1.8,"d":"2 "},{"v":0,"d":"0 "},{"v":0,"d":"0 "},{"$nulls":4},45759,"*","2025-04-12","土","休業日"]
[{"$f":"IF(B14=\"\",\"\",(COUNTIF($B$2:B14,B14)))","v":""},"","Ｉｑ手すり１８２９","L1829　φ42.7",{"$f":"入力!I17","v":0},"　Iｑシステム","Iq手すり","IQC1829",{"v":4.4,"d":"4.40"},null,13,"","","",null,"IQC1829","Ｉｑ手すり１８２９",{"v":0,"d":"0 "},{"v":4.4,"d":"4 "},{"v":0,"d":"0 "},{"v":0,"d":"0 "},null,null,{"$f":"VLOOKUP(X3,AB2:AD366,3,TRUE)","v":{"$error":"#N/A"}},null,45760,"*","2025-04-13","日","休業日"]
[{"$f":"IF(B15=\"\",\"\",(COUNTIF($B$2:B15,B15)))","v":""},"","Ｉｑ手すり１５２４【黄】","L1524　φ42.7",{"$f":"入力!I18","v":0},"　Iｑシステム","Iq手すり","IQC1524",{"v":3.7,"d":"3.70"},null,14,"","","",null,"IQC1524","Ｉｑ手すり１５２４【黄】",{"v":0,"d":"0 "},{"v":3.7,"d":"4 "},{"v":0,"d":"0 "},{"v":0,"d":"0 "},{"$nulls":4},45761,"","2025-04-14","月"]
[{"$f":"IF(B16=\"\",\"\",(COUNTIF($B$2:B16,B16)))","v":""},"","Ｉｑ手すり１２１９【青】","L・W1219　φ42.7",{"$f":"入力!I19","v":0},"　Iｑシステム","Iq手すり","IQC1219",{"v":3,"d":"3.00"},null,15,"","","",null,"IQC1219","Ｉｑ手すり１２１９【青】",{"v":0,"d":"0 "},{"v":3,"d":"3 "},{"v":0,"d":"0 "},{"v":0,"d":"0 "},{"$nulls":4},45762,"","2025-04-15","火"]
[{"$f":"IF(B17=\"\",\"\",(COUNTIF($B$2:B17,B17)))","v":""},"","Ｉｑ手すり１１０７【黄緑】","梁専用 W1107　φ42.7",{"$f":"入力!I20","v":0},"　Iｑシステム","Iq手すり","IQC1107",{"v":2.8,"d":"2.80"},null,16,"","","",null,"IQC1107","Ｉｑ手すり１１０７【黄緑】",{"v":0,"d":"0 "},{"v":2.8,"d":"3 "},{"v":0,"d":"0 "},{"v":0,"d":"0 "},{"$nulls":4},45763,"","2025-04-16","水"]
[{"$f":"IF(B18=\"\",\"\",(COUNTIF($B$2:B18,B18)))","v":""},"","Ｉｑ手すり９１４【ピンク】","L・W914　φ42.7",{"$f":"入力!I21","v":0},"　Iｑシステム","Iq手すり","IQC914",{"v":2.3,"d":"2.30"},null,17,"","","",null,"IQC914","Ｉｑ手すり９１４【ピンク】",{"v":0,"d":"0 "},{"v":2.3,"d":"2 "},{"v":0,"d":"0 "},{"v":0,"d":"0 "},{"$nulls":4},45764,"","2025-04-17","木"]
[{"$f":"IF(B19=\"\",\"\",(COUNTIF($B$2:B19,B19)))","v":""},"","Ｉｑ手すり７２２【ムラサキ】","※コーナー調整専用（1.829-1.107）",{"$f":"入力!I22","v":0},"　Iｑシステム","Iq手すり","IQC722",{"v":2,"d":"2.00"},null,18,"","","",null,"IQC722","Ｉｑ手すり７２２【ムラサキ】",{"v":0,"d":"0 "},{"v":2,"d":"2 "},{"v":0,"d":"0 "},{"v":0,"d":"0 "},{"$nulls":4},45765,"","2025-04-18","金"]
[{"$f":"IF(B20=\"\",\"\",(COUNTIF($B$2:B20,B20)))","v":""},"","Ｉｑ手すり６１０","L・W610　φ42.7",{"$f":"入力!I23","v":0},"　Iｑシステム","Iq手すり","IQC610",{"v":1.6,"d":"1.60"},null,19,"","","",null,"IQC610","Ｉｑ手すり６１０",{"v":0,"d":"0 "},{"v":1.6,"d":"2 "},{"v":0,"d":"0 "},{"v":0,"d":"0 "},{"$nulls":4},45766,"*","2025-04-19","土","休業日"]
[{"$f":"IF(B21=\"\",\"\",(COUNTIF($B$2:B21,B21)))","v":""},"","Ｉｑ手すり３６０【オレンジ】","L360　φ42.7",{"$f":"入力!I24","v":0},"　Iｑシステム","Iq手すり","IQC360",{"v":1,"d":"1.00"},20,20,"","","",null,"IQC360","Ｉｑ手すり３６０【オレンジ】",{"v":0,"d":"0 "},{"v":1,"d":"1 "},{"v":0,"d":"0 "},{"v":20,"d":"20 "},{"$f":"ROUNDDOWN(R21/U21,0)","v":{"v":0,"d":"0 "}},{"$nulls":3},45767,"*","2025-04-20","日","休業日"]
[{"$f":"IF(B22=\"\",\"\",(COUNTIF($B$2:B22,B22)))","v":""},"","Ｉｑ手すり３０５","L305　φ42.7",{"$f":"入力!I25","v":0},"　Iｑシステム","Iq手すり","IQC305",{"v":0.9,"d":"0.90"},20,21,"","","",null,"IQC305","Ｉｑ手すり３０５",{"v":0,"d":"0 "},{"v":0.9,"d":"1 "},{"v":0,"d":"0 "},{"v":20,"d":"20 "},{"v":0,"d":"0 "},{"$nulls":3},45768,"","2025-04-21","月"]
[{"$f":"IF(B23=\"\",\"\",(COUNTIF($B$2:B23,B23)))","v":""},"","Ｉｑ手すり２５０【黒】","L250　φ42.7",{"$f":"入力!I26","v":0},"　Iｑシステム","Iq手すり","IQC250",{"v":0.8,"d":"0.80"},20,22,"","","",null,"IQC250","Ｉｑ手すり２５０【黒】",{"v":0,"d":"0 "},{"v":0.8,"d":"1 "},{"v":0,"d":"0 "},{"v":20,"d":"20 "},{"$f":"ROUNDDOWN(R23/U23,0)","v":{"v":0,"d":"0 "}},{"$nulls":3},45769,"","2025-04-22","火"]
[{"$f":"IF(B24=\"\",\"\",(COUNTIF($B$2:B24,B24)))","v":""},"","Ｉｑ【先行】手すり１８２９","L1829　φ27.2",{"$f":"入力!I27","v":0},"　Iｑシステム","Iq先行手すり","IQSCX18",{"v":7.2,"d":"7.20"},null,23,"","","",null,"IQSCX18","Ｉｑ【先行】手すり１８２９",{"v":0,"d":"0 "},{"v":7.2,"d":"7 "},{"v":0,"d":"0 "},{"v":0,"d":"0 "},{"$nulls":4},45770,"","2025-04-23","水"]
[{"$f":"IF(B25=\"\",\"\",(COUNTIF($B$2:B25,B25)))","v":""},"","Ｉｑ【先行】手すり１５２４【黄】","L1524　φ27.2",{"$f":"入力!I28","v":0},"　Iｑシステム","Iq先行手すり","IQSCX15",{"v":6.3,"d":"6.30"},null,24,"","","",null,"IQSCX15","Ｉｑ【先行】手すり１５２４【黄】",{"v":0,"d":"0 "},{"v":6.3,"d":"6 "},{"v":0,"d":"0 "},{"v":0,"d":"0 "},{"$f":"T25*U25","v":{"v":0,"d":"0 "}},null,{"$f":"IF(T1>X12,\"積載重量超過！　発注数量の調整をお願いします。\",\"\")","v":""},null,45771,"","2025-04-24","木"]
[{"$f":"IF(B26=\"\",\"\",(COUNTIF($B$2:B26,B26)))","v":""},"","Ｉｑ【先行】手すり１２１９【青】","L1219　φ27.2",{"$f":"入力!I29","v":0},"　Iｑシステム","Iq先行手すり","IQSCX12",{"v":5.5,"d":"5.50"},null,25,"","","",null,"IQSCX12","Ｉｑ【先行】手すり１２１９【青】",{"v":0,"d":"0 "},{"v":5.5,"d":"6 "},{"v":0,"d":"0 "},{"v":0,"d":"0 "},{"v":0,"d":"0 "},{"$nulls":3},45772,"","2025-04-25","金"]
[{"$f":"IF(B27=\"\",\"\",(COUNTIF($B$2:B27,B27)))","v":""},"","Ｉｑ【先行】手すり９１４【ピンク】","L914　φ27.2",{"$f":"入力!I30","v":0},"　Iｑシステム","Iq先行手すり","IQSCX09",{"v":4.7,"d":"4.70"},null,26,"","","",null,"IQSCX09","Ｉｑ【先行】手すり９１４【ピンク】",{"v":0,"d":"0 "},{"v":4.7,"d":"5 "},{"v":0,"d":"0 "},{"v":0,"d":"0 "},{"v":0,"d":"0 "},{"$nulls":3},45773,"*","2025-04-26","土","休業日"]
[{"$f":"IF(B28=\"\",\"\",(COUNTIF($B$2:B28,B28)))","v":""},"","Ｉｑ【先行】手すり６１０【黄緑】","L610　φ27.2",{"$f":"入力!I31","v":0},"　Iｑシステム","Iq先行手すり","IQSCX06",{"v":4,"d":"4.00"},null,27,"","","",null,"IQSCX06","Ｉｑ【先行】手すり６１０【黄緑】",{"v":0,"d":"0 "},{"v":4,"d":"4 "},{"v":0,"d":"0 "},{"v":0,"d":"0 "},{"v":0,"d":"0 "},{"$nulls":3},45774,"*","2025-04-27","日","休業日"]
[{"$f":"IF(B29=\"\",\"\",(COUNTIF($B$2:B29,B29)))","v":""},"","Ｉｑアルミカイダン１９","7段　W481　L2471",{"$f":"入力!I32","v":0},"　Iｑシステム","Iqカイダン類","IQKD19",{"v":13.5,"d":"13.50"},null,28,"","","",null,"IQKD19","Ｉｑアルミカイダン１９",{"v":0,"d":"0 "},{"v":13.5,"d":"14 "},{"v":0,"d":"0 "},{"v":0,"d":"0 "},{"v":0,"d":"0 "},{"$nulls":3},45775,"*","2025-04-28","月","GW休業日"]
[{"$f":"IF(B30=\"\",\"\",(COUNTIF($B$2:B30,B30)))","v":""},"","Ｉｑカイダンレール　斜め手すり ","2段目以上用　(1ヵ所あたり2本使用）L2445　",{"$f":"入力!I33","v":0},"　Iｑシステム","Iqカイダン類","IQKDR",{"v":3.6,"d":"3.60"},null,29,"","","",null,"IQKDR","Ｉｑカイダンレール　斜め手すり ",{"v":0,"d":"0 "},{"v":3.6,"d":"4 "},{"v":0,"d":"0 "},{"v":0,"d":"0 "},{"v":0,"d":"0 "},{"$nulls":3},45776,"*","2025-04-29","火","GW休業日"]
[{"$f":"IF(B31=\"\",\"\",(COUNTIF($B$2:B31,B31)))","v":""},"","Ｉｑアイテスリ　階段開口部用手すり","H1000　L1829",{"$f":"入力!I34","v":0},"　Iｑシステム","Iqカイダン類","IQKKTG",{"v":15,"d":"15.00"},null,30,"","","",null,"IQKKTG","Ｉｑアイテスリ　階段開口部用手すり",{"v":0,"d":"0 "},{"v":15,"d":"15 "},{"v":0,"d":"0 "},{"v":0,"d":"0 "},{"v":0,"d":"0 "},{"$nulls":3},45777,"*","2025-04-30","水","GW休業日"]
[{"$f":"IF(B32=\"\",\"\",(COUNTIF($B$2:B32,B32)))","v":""},"","ＳＰカイダン手摺　斜め手すり","最下段用　二段一体式",{"$f":"入力!I35","v":0},"　Iｑシステム","Iqカイダン類","VKTSP",{"v":4.2,"d":"4.20"},null,31,"","","",null,"VKTSP","ＳＰカイダン手摺　斜め手すり",{"v":0,"d":"0 "},{"v":4.2,"d":"4 "},{"v":0,"d":"0 "},{"v":0,"d":"0 "},{"v":0,"d":"0 "},{"$nulls":3},45778,"*","2025-05-01","木","GW休業日"]
[{"$f":"IF(B33=\"\",\"\",(COUNTIF($B$2:B33,B33)))","v":""},"","Ｉｑ張出ブラケット６１０","L610　H243",{"$f":"入力!I36","v":0},"　Iｑシステム","Iqブラケット","IQBH610",{"v":2.9,"d":"2.90"},null,32,"","","",null,"IQBH610","Ｉｑ張出ブラケット６１０",{"v":0,"d":"0 "},{"v":2.9,"d":"3 "},{"v":0,"d":"0 "},{"v":0,"d":"0 "},{"v":0,"d":"0 "},{"$nulls":3},45779,"*","2025-05-02","金","GW休業日"]
[{"$f":"IF(B34=\"\",\"\",(COUNTIF($B$2:B34,B34)))","v":""},"","Ｉｑ張出ブラケット３６０","L360　H240",{"$f":"入力!I37","v":0},"　Iｑシステム","Iqブラケット","IQBH360",{"v":2.2,"d":"2.20"},null,33,"","","",null,"IQBH360","Ｉｑ張出ブラケット３６０",{"v":0,"d":"0 "},{"v":2.2,"d":"2 "},{"v":0,"d":"0 "},{"v":0,"d":"0 "},{"v":0,"d":"0 "},{"$nulls":3},45780,"*","2025-05-03","土","休業日"]
[{"$f":"IF(B35=\"\",\"\",(COUNTIF($B$2:B35,B35)))","v":""},"","Ｉｑブラケット６１０","L610　H263",{"$f":"入力!I38","v":0},"　Iｑシステム","Iqブラケット","IQB610",{"v":2.4,"d":"2.40"},null,34,"","","",null,"IQB610","Ｉｑブラケット６１０",{"v":0,"d":"0 "},{"v":2.4,"d":"2 "},{"v":0,"d":"0 "},{"v":0,"d":"0 "},{"v":0,"d":"0 "},{"$nulls":3},45781,"*","2025-05-04","日","休業日"]
[{"$f":"IF(B36=\"\",\"\",(COUNTIF($B$2:B36,B36)))","v":""},"","Ｉｑブラケット３６０","L360　H244",{"$f":"入力!I39","v":0},"　Iｑシステム","Iqブラケット","IQB360",{"v":1.6,"d":"1.60"},null,35,"","","",null,"IQB360","Ｉｑブラケット３６０",{"v":0,"d":"0 "},{"v":1.6,"d":"2 "},{"v":0,"d":"0 "},{"v":0,"d":"0 "},{"v":0,"d":"0 "},{"$nulls":3},45782,"*","2025-05-05","月","GW休業日"]
[{"$f":"IF(B37=\"\",\"\",(COUNTIF($B$2:B37,B37)))","v":""},"","Ｉｑ伸縮ブラケット７１","L770～1065　H446",{"$f":"入力!I40","v":0},"　Iｑシステム","Iqブラケット","IQBS71",{"v":7.2,"d":"7.20"},null,36,"","","",null,"IQBS71","Ｉｑ伸縮ブラケット７１",{"v":0,"d":"0 "},{"v":7.2,"d":"7 "},{"v":0,"d":"0 "},{"v":0,"d":"0 "},{"v":0,"d":"0 "},{"$nulls":3},45783,"*","2025-05-06","火","GW休業日"]
[{"$f":"IF(B38=\"\",\"\",(COUNTIF($B$2:B38,B38)))","v":""},"","Ｉｑ伸縮ブラケット５７","L505～799　H446",{"$f":"入力!I41","v":0},"　Iｑシステム","Iqブラケット","IQBS57",{"v":6.2,"d":"6.20"},null,37,"","","",null,"IQBS57","Ｉｑ伸縮ブラケット５７",{"v":0,"d":"0 "},{"v":6.2,"d":"6 "},{"v":0,"d":"0 "},{"v":0,"d":"0 "},{"v":0,"d":"0 "},{"$nulls":3},45784,"","2025-05-07","水"]
[{"$f":"IF(B39=\"\",\"\",(COUNTIF($B$2:B39,B39)))","v":""},"","Ｉｑ伸縮ブラケット３５","L355～570　H379",{"$f":"入力!I42","v":0},"　Iｑシステム","Iqブラケット","IQBS35",{"v":3.6,"d":"3.60"},null,38,"","","",null,"IQBS35","Ｉｑ伸縮ブラケット３５",{"v":0,"d":"0 "},{"v":3.6,"d":"4 "},{"v":0,"d":"0 "},{"v":0,"d":"0 "},{"v":0,"d":"0 "},{"$nulls":3},45785,"","2025-05-08","木"]
[{"$f":"IF(B40=\"\",\"\",(COUNTIF($B$2:B40,B40)))","v":""},"","Ｉｑ伸縮ブラケット先端C","φ48.6用",{"$f":"入力!I43","v":0},"　Iｑシステム","Iqブラケット","IQBSC",{"v":1,"d":"1.00"},30,39,"","","",null,"IQBSC","Ｉｑ伸縮ブラケット先端C",{"v":0,"d":"0 "},{"v":1,"d":"1 "},{"v":0,"d":"0 "},{"v":30,"d":"30 "},{"$f":"ROUNDDOWN(R40/U40,0)","v":{"v":0,"d":"0 "}},{"$nulls":3},45786,"","2025-05-09","金"]
[{"$f":"IF(B41=\"\",\"\",(COUNTIF($B$2:B41,B41)))","v":""},"","Ｉｑ拡幅挟幅アタッチメント３０５","L1357",{"$f":"入力!I44","v":0},"　Iｑシステム","Iq拡幅狭幅部材・フレーム補強材","IQBHKA",{"v":3.8,"d":"3.80"},null,40,"","","",null,"IQBHKA","Ｉｑ拡幅挟幅アタッチメント３０５",{"v":0,"d":"0 "},{"v":3.8,"d":"4 "},{"v":0,"d":"0 "},{"v":0,"d":"0 "},{"v":0,"d":"0 "},{"$nulls":3},45787,"*","2025-05-10","土","休業日"]
[{"$f":"IF(B42=\"\",\"\",(COUNTIF($B$2:B42,B42)))","v":""},"","Ｉｑ拡幅挟幅ブラケット３０５","W610⇐914⇒1219拡幅挟幅用　L305　H185",{"$f":"入力!I45","v":0},"　Iｑシステム","Iq拡幅狭幅部材・フレーム補強材","IQBHK305",{"v":2.3,"d":"2.30"},null,41,"","","",null,"IQBHK305","Ｉｑ拡幅挟幅ブラケット３０５",{"v":0,"d":"0 "},{"v":2.3,"d":"2 "},{"v":0,"d":"0 "},{"v":0,"d":"0 "},{"v":0,"d":"0 "},{"$nulls":3},45788,"*","2025-05-11","日","休業日"]
[{"$f":"IF(B43=\"\",\"\",(COUNTIF($B$2:B43,B43)))","v":""},"","Ｉｑ拡幅挟幅アタッチメント４９７","L1450",{"$f":"入力!I46","v":0},"　Iｑシステム","Iq拡幅狭幅部材・フレーム補強材","IQBHKB",{"v":4.1,"d":"4.10"},null,42,"","","",null,"IQBHKB","Ｉｑ拡幅挟幅アタッチメント４９７",{"v":0,"d":"0 "},{"v":4.1,"d":"4 "},{"v":0,"d":"0 "},{"v":0,"d":"0 "},{"v":0,"d":"0 "},{"$nulls":3},45789,"","2025-05-12","月"]
[{"$f":"IF(B44=\"\",\"\",(COUNTIF($B$2:B44,B44)))","v":""},"","Ｉｑ拡幅挟幅ブラケット４９７","W1107⇒610挟幅用　L497　H185　",{"$f":"入力!I47","v":0},"　Iｑシステム","Iq拡幅狭幅部材・フレーム補強材","IQBHK497",{"v":2.6,"d":"2.60"},null,43,"","","",null,"IQBHK497","Ｉｑ拡幅挟幅ブラケット４９７",{"v":0,"d":"0 "},{"v":2.6,"d":"3 "},{"v":0,"d":"0 "},{"v":0,"d":"0 "},{"v":0,"d":"0 "},{"$nulls":3},45790,"","2025-05-13","火"]
[{"$f":"IF(B45=\"\",\"\",(COUNTIF($B$2:B45,B45)))","v":""},"","Ｉｑフレーム補強材１２１９","W1219用",{"$f":"入力!I48","v":0},"　Iｑシステム","Iq拡幅狭幅部材・フレーム補強材","IQFH1219",{"v":6.6,"d":"6.60"},null,44,"","","",null,"IQFH1219","Ｉｑフレーム補強材１２１９",{"v":0,"d":"0 "},{"v":6.6,"d":"7 "},{"v":0,"d":"0 "},{"v":0,"d":"0 "},{"v":0,"d":"0 "},{"$nulls":3},45791,"","2025-05-14","水"]
[{"$f":"IF(B46=\"\",\"\",(COUNTIF($B$2:B46,B46)))","v":""},"","Ｉｑフレーム補強材１１０７","W1107用",{"$f":"入力!I49","v":0},"　Iｑシステム","Iq拡幅狭幅部材・フレーム補強材","IQFH1107",{"v":6.4,"d":"6.40"},null,45,"","","",null,"IQFH1107","Ｉｑフレーム補強材１１０７",{"v":0,"d":"0 "},{"v":6.4,"d":"6 "},{"v":0,"d":"0 "},{"v":0,"d":"0 "},{"v":0,"d":"0 "},{"$nulls":3},45792,"","2025-05-15","木"]
[{"$f":"IF(B47=\"\",\"\",(COUNTIF($B$2:B47,B47)))","v":""},"","Ｉｑフレーム補強材９１４","W914用",{"$f":"入力!I50","v":0},"　Iｑシステム","Iq拡幅狭幅部材・フレーム補強材","IQFH914",{"v":6.1,"d":"6.10"},null,46,"","","",null,"IQFH914","Ｉｑフレーム補強材９１４",{"v":0,"d":"0 "},{"v":6.1,"d":"6 "},{"v":0,"d":"0 "},{"v":0,"d":"0 "},{"v":0,"d":"0 "},{"$nulls":3},45793,"","2025-05-16","金"]
[{"$f":"IF(B48=\"\",\"\",(COUNTIF($B$2:B48,B48)))","v":""},"","Ｉｑフレーム補強材６１０","W610用",{"$f":"入力!I51","v":0},"　Iｑシステム","Iq拡幅狭幅部材・フレーム補強材","IQFH610",{"v":5.1,"d":"5.10"},null,47,"","","",null,"IQFH610","Ｉｑフレーム補強材６１０",{"v":0,"d":"0 "},{"v":5.1,"d":"5 "},{"v":0,"d":"0 "},{"v":0,"d":"0 "},{"v":0,"d":"0 "},{"$nulls":3},45794,"*","2025-05-17","土","休業日"]
[{"$f":"IF(B49=\"\",\"\",(COUNTIF($B$2:B49,B49)))","v":""},"","Ｉｑ梁枠１．５スパン ","L2743　(1.829+0.914)",{"$f":"入力!I52","v":0},"　Iｑシステム","Iq用　梁枠・その他部材","IQG1.5",{"v":16,"d":"16.00"},null,48,"","","",null,"IQG1.5","Ｉｑ梁枠１．５スパン ",{"v":0,"d":"0 "},{"v":16,"d":"16 "},{"v":0,"d":"0 "},{"v":0,"d":"0 "},{"v":0,"d":"0 "},{"$nulls":3},45795,"*","2025-05-18","日","休業日"]
[{"$f":"IF(B50=\"\",\"\",(COUNTIF($B$2:B50,B50)))","v":""},"","Ｉｑ梁枠２スパン","L3658",{"$f":"入力!I53","v":0},"　Iｑシステム","Iq用　梁枠・その他部材","IQG2",{"v":21.2,"d":"21.20"},null,49,"","","",null,"IQG2","Ｉｑ梁枠２スパン",{"v":0,"d":"0 "},{"v":21.2,"d":"21 "},{"v":0,"d":"0 "},{"v":0,"d":"0 "},{"v":0,"d":"0 "},{"$nulls":3},45796,"","2025-05-19","月"]
[{"$f":"IF(B51=\"\",\"\",(COUNTIF($B$2:B51,B51)))","v":""},"","Ｉｑ梁枠３スパン","L5487",{"$f":"入力!I54","v":0},"　Iｑシステム","Iq用　梁枠・その他部材","IQG3",{"v":35.5,"d":"35.50"},null,null,"","","",null,"IQG3","Ｉｑ梁枠３スパン",{"v":0,"d":"0 "},{"v":35.5,"d":"36 "},{"v":0,"d":"0 "},{"v":0,"d":"0 "},{"v":0,"d":"0 "},{"$nulls":3},45797,"","2025-05-20","火"]
[{"$f":"IF(B52=\"\",\"\",(COUNTIF($B$2:B52,B52)))","v":""},"","Ｉｑ梁枠４スパン差込側　※1セット:差込2＋受け2","L3634　H475　",{"$f":"入力!I55","v":0},"　Iｑシステム","Iq用　梁枠・その他部材","IQN4S",{"v":29.5,"d":"29.50"},null,null,"","","",null,"IQN4S","Ｉｑ梁枠４スパン差込側　※1セット:差込2＋受け2",{"v":0,"d":"0 "},{"v":29.5,"d":"30 "},{"v":0,"d":"0 "},{"v":0,"d":"0 "},{"v":0,"d":"0 "},{"$nulls":3},45798,"","2025-05-21","水"]
[{"$f":"IF(B53=\"\",\"\",(COUNTIF($B$2:B53,B53)))","v":""},"","Ｉｑ梁枠４スパン受け側　","L3634　H475",{"$f":"入力!I56","v":0},"　Iｑシステム","Iq用　梁枠・その他部材","IQG4U",{"v":28.9,"d":"28.90"},null,null,"","","",null,"IQG4U","Ｉｑ梁枠４スパン受け側　",{"v":0,"d":"0 "},{"v":28.9,"d":"29 "},{"v":0,"d":"0 "},{"v":0,"d":"0 "},{"$nulls":4},45799,"","2025-05-22","木"]
[{"$f":"IF(B54=\"\",\"\",(COUNTIF($B$2:B54,B54)))","v":""},"","Ｉｑ梁枠４スパン梁受金具","4スパン1セットに6個使用",{"$f":"入力!I57","v":0},"　Iｑシステム","Iq用　梁枠・その他部材","IQG4GSWK",{"v":1.1,"d":"1.10"},6,null,"","","",null,"IQG4GSWK","Ｉｑ梁枠４スパン梁受金具",{"v":0,"d":"0 "},{"v":1.1,"d":"1 "},{"v":0,"d":"0 "},{"v":6,"d":"6 "},{"$f":"ROUNDDOWN(R54/U54,0)","v":{"v":0,"d":"0 "}},{"$nulls":3},45800,"","2025-05-23","金"]
[{"$f":"IF(B55=\"\",\"\",(COUNTIF($B$2:B55,B55)))","v":""},"","Ｉｑ荷受ステージ　(許容支持力：750㎏)","W1829　D1524",{"$f":"入力!I58","v":0},"　Iｑシステム","Iq用　梁枠・その他部材","IQNS",{"v":14.7,"d":"14.70"},null,null,"","","",null,"IQNS","Ｉｑ荷受ステージ　(許容支持力：750㎏)",{"v":0,"d":"0 "},{"v":14.7,"d":"15 "},{"v":0,"d":"0 "},{"v":0,"d":"0 "},{"$nulls":4},45801,"*","2025-05-24","土","休業日"]
[{"$f":"IF(B56=\"\",\"\",(COUNTIF($B$2:B56,B56)))","v":""},"","Ｉｑ大筋交クランプ","L150",{"$f":"入力!I59","v":0},"　Iｑシステム","Iq用　梁枠・その他部材","IQRC",{"v":1,"d":"1.00"},10,null,"","","",null,"IQRC","Ｉｑ大筋交クランプ",{"v":0,"d":"0 "},{"v":1,"d":"1 "},{"v":0,"d":"0 "},{"v":10,"d":"10 "},{"$f":"ROUNDDOWN(R56/U56,0)","v":{"v":0,"d":"0 "}},{"$nulls":3},45802,"*","2025-05-25","日","休業日"]
[{"$f":"IF(B57=\"\",\"\",(COUNTIF($B$2:B57,B57)))","v":""},"","Ｉｑ吊り治具　（Iqフランジ専用）","4点吊り＝1セット：4個使用",{"$f":"入力!I60","v":0},"　Iｑシステム","Iq用　梁枠・その他部材","IQTG",{"v":1.2,"d":"1.20"},4,null,"","","",null,"IQTG","Ｉｑ吊り治具　（Iqフランジ専用）",{"v":0,"d":"0 "},{"v":1.2,"d":"1 "},{"v":0,"d":"0 "},{"v":4,"d":"4 "},{"v":0,"d":"0 "},{"$nulls":3},45803,"","2025-05-26","月"]
[{"$f":"IF(B58=\"\",\"\",(COUNTIF($B$2:B58,B58)))","v":""},"","Ｉｑ吊り治具シャックル","※治具とセットで使用　φ16（SC16）",{"$f":"入力!I61","v":0},"　Iｑシステム","Iq用　梁枠・その他部材","IQTS",{"v":0.6,"d":"0.60"},null,null,"","","",null,"IQTS","Ｉｑ吊り治具シャックル",{"v":0,"d":"0 "},{"v":0.6,"d":"1 "},{"v":0,"d":"0 "},{"v":0,"d":"0 "},{"v":0,"d":"0 "},{"$nulls":3},45804,"","2025-05-27","火"]
[{"$f":"IF(B59=\"\",\"\",(COUNTIF($B$2:B59,B59)))","v":""},"","Ｉｑ支柱結束枠 （2枠で1セット）","W704　H354",{"$f":"入力!I62","v":0},"　Iｑシステム","Iq用　梁枠・その他部材","IQAKW",{"v":5.1,"d":"5.10"},null,null,"","","",null,"IQAKW","Ｉｑ支柱結束枠 （2枠で1セット）",{"v":0,"d":"0 "},{"v":5.1,"d":"5 "},{"v":0,"d":"0 "},{"v":0,"d":"0 "},{"v":0,"d":"0 "},{"$nulls":3},45805,"","2025-05-28","水"]
[{"$f":"IF(B60=\"\",\"\",(COUNTIF($B$2:B60,B60)))","v":""},"","Ｉｑローリングタワー　３段仕様","作業床高：約2.51ｍ　床：1829×1219",{"$f":"入力!I63","v":0},"　Iｑシステム","ローリングタワー","IQRT3",{"v":274.1,"d":"274.10"},null,null,"","","",null,"IQRT3","Ｉｑローリングタワー　３段仕様",{"v":0,"d":"0 "},{"v":274.1,"d":"274 "},{"v":0,"d":"0 "},{"v":0,"d":"0 "},{"v":0,"d":"0 "},{"$nulls":3},45806,"","2025-05-29","木"]
[{"$f":"IF(B61=\"\",\"\",(COUNTIF($B$2:B61,B61)))","v":""},"","Ｉｑローリングタワー　4段仕様","作業床高：約4.41ｍ　床：1829×1219",{"$f":"入力!I64","v":0},"　Iｑシステム","ローリングタワー","IQRT4",{"v":378.9,"d":"378.90"},null,null,"","","",null,"IQRT4","Ｉｑローリングタワー　4段仕様",{"v":0,"d":"0 "},{"v":378.9,"d":"379 "},{"v":0,"d":"0 "},{"v":0,"d":"0 "},{"v":0,"d":"0 "},{"$nulls":3},45807,"","2025-05-30","金"]
[{"$f":"IF(B62=\"\",\"\",(COUNTIF($B$2:B62,B62)))","v":""},"","Ｉｑローリングタワー　５段仕様","作業床高：約6.31ｍ　床：1829×1219",{"$f":"入力!I65","v":0},"　Iｑシステム","ローリングタワー","IQRT5",{"v":483.7,"d":"483.70"},null,null,"","","",null,"IQRT5","Ｉｑローリングタワー　５段仕様",{"v":0,"d":"0 "},{"v":483.7,"d":"484 "},{"v":0,"d":"0 "},{"v":0,"d":"0 "},{"v":0,"d":"0 "},{"$nulls":3},45808,"*","2025-05-31","土","休業日"]
[{"$f":"IF(B63=\"\",\"\",(COUNTIF($B$2:B63,B63)))","v":""},"","Ｓウォーク　Ｎ６","W490  L1829",{"$f":"入力!I66","v":0},"　布板・コーナーステップ","Ｓウォーク","ACN6",{"v":15.9,"d":"15.90"},null,null,"","","",null,"ACN6","Ｓウォーク　Ｎ６",{"v":0,"d":"0 "},{"v":15.9,"d":"16 "},{"v":0,"d":"0 "},{"v":0,"d":"0 "},{"v":0,"d":"0 "},{"$nulls":3},45809,"*","2025-06-01","日","休業日"]
[{"$f":"IF(B64=\"\",\"\",(COUNTIF($B$2:B64,B64)))","v":""},"","Ｓウォーク　６２４","W240  L1829",{"$f":"入力!I67","v":0},"　布板・コーナーステップ","Ｓウォーク","ACN624",{"v":8.9,"d":"8.90"},null,null,"","","",null,"ACN624","Ｓウォーク　６２４",{"v":0,"d":"0 "},{"v":8.9,"d":"9 "},{"v":0,"d":"0 "},{"v":0,"d":"0 "},{"v":0,"d":"0 "},{"$nulls":3},45810,"","2025-06-02","月"]
[{"$f":"IF(B65=\"\",\"\",(COUNTIF($B$2:B65,B65)))","v":""},"","Ｓウォーク　Ｎ５【黄】","W490  L1524",{"$f":"入力!I68","v":0},"　布板・コーナーステップ","Ｓウォーク","ACN5",{"v":13.9,"d":"13.90"},null,null,"","","",null,"ACN5","Ｓウォーク　Ｎ５【黄】",{"v":0,"d":"0 "},{"v":13.9,"d":"14 "},{"v":0,"d":"0 "},{"v":0,"d":"0 "},{"v":0,"d":"0 "},{"$nulls":3},45811,"","2025-06-03","火"]
[{"$f":"IF(B66=\"\",\"\",(COUNTIF($B$2:B66,B66)))","v":""},"","Ｓウォーク　５２４【黄】","W240  L1524",{"$f":"入力!I69","v":0},"　布板・コーナーステップ","Ｓウォーク","ACN524",{"v":8,"d":"8.00"},null,null,{"$f":"IFERROR(VLOOKUP(K66,$A$2:$E$999,3,FALSE),\"\")","v":""},{"$f":"IFERROR(VLOOKUP(K66,$A$2:$E$99,4,FALSE),\"\")","v":""},{"$f":"IFERROR(VLOOKUP(K66,$A$2:$E$499,5,FALSE),\"\")","v":""},null,{"$f":"IF(E66=\"0\",\"\",H66)","v":"ACN524"},{"$f":"IF(E66=\"0\",\"\",C66)","v":"Ｓウォーク　５２４【黄】"},{"v":0,"d":"0 "},{"v":8,"d":"8 "},{"v":0,"d":"0 "},{"$f":"IF(E66=\"0\",\"\",J66)","v":{"v":0,"d":"0 "}},{"v":0,"d":"0 "},{"$nulls":3},45812,"","2025-06-04",{"$f":"TEXT(AB66,\"aaa\")","v":"水"}]
[{"$f":"IF(B67=\"\",\"\",(COUNTIF($B$2:B67,B67)))","v":""},{"$f":"IF(E67,\"1\",\"\")","v":""},"Ｓウォーク　Ｎ４【青】","W490  L1219",{"$f":"入力!I70","v":0},"　布板・コーナーステップ","Ｓウォーク","ACN4",{"v":11.7,"d":"11.70"},null,null,"","","",null,"ACN4","Ｓウォーク　Ｎ４【青】",{"$f":"IF(E67=\"\",\"\",E67)","v":{"v":0,"d":"0 "}},{"$f":"IF(E67=\"\",0,I67)","v":{"v":11.7,"d":"12 "}},{"$f":"R67*S67","v":{"v":0,"d":"0 "}},{"v":0,"d":"0 "},{"$f":"T67*U67","v":{"v":0,"d":"0 "}},{"$nulls":3},{"$f":"AB67","v":45813},{"$f":"IF(AD67=\"\",\"\",\"*\")","v":""},"2025-06-05","木"]
[{"$f":"IF(B68=\"\",\"\",(COUNTIF($B$2:B68,B68)))","v":""},"","Ｓウォーク　４２４【青】","W240  L1219",{"$f":"入力!I71","v":0},"　布板・コーナーステップ","Ｓウォーク","ACN424",{"v":6.9,"d":"6.90"},null,null,"","","",null,"ACN424","Ｓウォーク　４２４【青】",{"v":0,"d":"0 "},{"v":6.9,"d":"7 "},{"v":0,"d":"0 "},{"v":0,"d":"0 "},{"v":0,"d":"0 "},{"$nulls":3},45814,"",{"$f":"AB67+1","v":"2025-06-06"},"金"]
[{"$f":"IF(B69=\"\",\"\",(COUNTIF($B$2:B69,B69)))","v":""},"","Ｓウォーク　Ｎ３【黄】","W490  L914",{"$f":"入力!I72","v":0},"　布板・コーナーステップ","Ｓウォーク","ACN3",{"v":9.5,"d":"9.50"},null,null,"","","",null,"ACN3","Ｓウォーク　Ｎ３【黄】",{"v":0,"d":"0 "},{"v":9.5,"d":"10 "},{"v":0,"d":"0 "},{"v":0,"d":"0 "},{"v":0,"d":"0 "},{"$nulls":3},45815,"*","2025-06-07","土","休業日"]
[{"$f":"IF(B70=\"\",\"\",(COUNTIF($B$2:B70,B70)))","v":""},"","Ｓウォーク　３２４【黄】","W240  L914",{"$f":"入力!I73","v":0},"　布板・コーナーステップ","Ｓウォーク","ACN324",{"v":5.8,"d":"5.80"},null,null,"","","",null,"ACN324","Ｓウォーク　３２４【黄】",{"v":0,"d":"0 "},{"v":5.8,"d":"6 "},{"v":0,"d":"0 "},{"v":0,"d":"0 "},{"v":0,"d":"0 "},{"$nulls":3},45816,"*","2025-06-08","日","休業日"]
[{"$f":"IF(B71=\"\",\"\",(COUNTIF($B$2:B71,B71)))","v":""},"","Ｓウォーク　Ｎ２【青】","W490  L610",{"$f":"入力!I74","v":0},"　布板・コーナーステップ","Ｓウォーク","ACN2",{"v":7.3,"d":"7.30"},null,null,"","","",null,"ACN2","Ｓウォーク　Ｎ２【青】",{"v":0,"d":"0 "},{"v":7.3,"d":"7 "},{"v":0,"d":"0 "},{"v":0,"d":"0 "},{"v":0,"d":"0 "},{"$nulls":3},45817,"","2025-06-09","月"]
[{"$f":"IF(B72=\"\",\"\",(COUNTIF($B$2:B72,B72)))","v":""},"","Ｓウォーク　２２４【青】","W240  L610",{"$f":"入力!I75","v":0},"　布板・コーナーステップ","Ｓウォーク","ACN224",{"v":4.7,"d":"4.70"},null,null,"","","",null,"ACN224","Ｓウォーク　２２４【青】",{"v":0,"d":"0 "},{"v":4.7,"d":"5 "},{"v":0,"d":"0 "},{"v":0,"d":"0 "},{"v":0,"d":"0 "},{"$nulls":3},45818,"","2025-06-10","火"]
[{"$f":"IF(B73=\"\",\"\",(COUNTIF($B$2:B73,B73)))","v":""},"","タラップ付布板１９","W462　L1829（開口部：700×415）",{"$f":"入力!I76","v":0},"　布板・コーナーステップ","Ｓウォーク","SKV19",{"v":17.4,"d":"17.40"},null,null,"","","",null,"SKV19","タラップ付布板１９",{"v":0,"d":"0 "},{"v":17.4,"d":"17 "},{"v":0,"d":"0 "},{"v":0,"d":"0 "},{"v":0,"d":"0 "},{"$nulls":3},45819,"","2025-06-11","水"]
[{"$f":"IF(B74=\"\",\"\",(COUNTIF($B$2:B74,B74)))","v":""},"","全開閉式アルミ布板１８","W490　L1829（開口部：1555×415）",{"$f":"入力!I77","v":0},"　布板・コーナーステップ","Ｓウォーク","ACRT18",{"v":12.5,"d":"12.50"},null,null,"","","",null,"ACRT18","全開閉式アルミ布板１８",{"v":0,"d":"0 "},{"v":12.5,"d":"13 "},{"v":0,"d":"0 "},{"v":0,"d":"0 "},{"v":0,"d":"0 "},{"$nulls":3},45820,"","2025-06-12","木"]
[{"$f":"IF(B75=\"\",\"\",(COUNTIF($B$2:B75,B75)))","v":""},"","Ｇウォーク　Ｎ６　　　　　　※要在庫確認","W490  L1829　すき間塞ぎなしタイプ",{"$f":"入力!I78","v":0},"　布板・コーナーステップ","Ｇウォーク","ACG6",{"v":13.9,"d":"13.90"},null,null,"","","",null,"ACG6","Ｇウォーク　Ｎ６　　　　　　※要在庫確認",{"v":0,"d":"0 "},{"v":13.9,"d":"14 "},{"v":0,"d":"0 "},{"v":0,"d":"0 "},{"v":0,"d":"0 "},{"$nulls":3},45821,"","2025-06-13","金"]
[{"$f":"IF(B76=\"\",\"\",(COUNTIF($B$2:B76,B76)))","v":""},"","Ｇウォーク　６２４　　　　　※要在庫確認","W240  L1829　すき間塞ぎなしタイプ",{"$f":"入力!I79","v":0},"　布板・コーナーステップ","Ｇウォーク","ACG624",{"v":7.7,"d":"7.70"},null,null,"","","",null,"ACG624","Ｇウォーク　６２４　　　　　※要在庫確認",{"v":0,"d":"0 "},{"v":7.7,"d":"8 "},{"v":0,"d":"0 "},{"v":0,"d":"0 "},{"v":0,"d":"0 "},{"$nulls":3},45822,"*","2025-06-14","土","休業日"]
[{"$f":"IF(B77=\"\",\"\",(COUNTIF($B$2:B77,B77)))","v":""},"","Ｇウォーク　Ｎ５【黄】　　　※要在庫確認","W490  L1524　すき間塞ぎなしタイプ",{"$f":"入力!I80","v":0},"　布板・コーナーステップ","Ｇウォーク","ACG5",{"v":11.7,"d":"11.70"},null,null,"","","",null,"ACG5","Ｇウォーク　Ｎ５【黄】　　　※要在庫確認",{"v":0,"d":"0 "},{"v":11.7,"d":"12 "},{"v":0,"d":"0 "},{"v":0,"d":"0 "},{"v":0,"d":"0 "},{"$nulls":3},45823,"*","2025-06-15","日","休業日"]
[{"$f":"IF(B78=\"\",\"\",(COUNTIF($B$2:B78,B78)))","v":""},"","Ｇウォーク　５２４【黄】　　※要在庫確認","W240  L1524　すき間塞ぎなしタイプ",{"$f":"入力!I81","v":0},"　布板・コーナーステップ","Ｇウォーク","ACG524",{"v":6.6,"d":"6.60"},null,null,"","","",null,"ACG524","Ｇウォーク　５２４【黄】　　※要在庫確認",{"v":0,"d":"0 "},{"v":6.6,"d":"7 "},{"v":0,"d":"0 "},{"v":0,"d":"0 "},{"v":0,"d":"0 "},{"$nulls":3},45824,"","2025-06-16","月"]
[{"$f":"IF(B79=\"\",\"\",(COUNTIF($B$2:B79,B79)))","v":""},"","Gウォーク　Ｎ４【青】　　　※要在庫確認","W490  L1219　すき間塞ぎなしタイプ",{"$f":"入力!I82","v":0},"　布板・コーナーステップ","Ｇウォーク","ACG4",{"v":9.9,"d":"9.90"},null,null,"","","",null,"ACG4","Gウォーク　Ｎ４【青】　　　※要在庫確認",{"v":0,"d":"0 "},{"v":9.9,"d":"10 "},{"v":0,"d":"0 "},{"v":0,"d":"0 "},{"v":0,"d":"0 "},{"$nulls":3},45825,"","2025-06-17","火"]
[{"$f":"IF(B80=\"\",\"\",(COUNTIF($B$2:B80,B80)))","v":""},"","Ｇウォーク　４２４【青】　　※要在庫確認","W240  L1219　すき間塞ぎなしタイプ",{"$f":"入力!I83","v":0},"　布板・コーナーステップ","Ｇウォーク","ACG424",{"v":5.7,"d":"5.70"},null,null,"","","",null,"ACG424","Ｇウォーク　４２４【青】　　※要在庫確認",{"v":0,"d":"0 "},{"v":5.7,"d":"6 "},{"v":0,"d":"0 "},{"v":0,"d":"0 "},{"v":0,"d":"0 "},{"$nulls":3},45826,"","2025-06-18","水"]
[{"$f":"IF(B81=\"\",\"\",(COUNTIF($B$2:B81,B81)))","v":""},"","Ｇウォーク　Ｎ３【黄】　　　※要在庫確認","W490  L914　すき間塞ぎなしタイプ",{"$f":"入力!I84","v":0},"　布板・コーナーステップ","Ｇウォーク","ACG3",{"v":7.7,"d":"7.70"},null,null,"","","",null,"ACG3","Ｇウォーク　Ｎ３【黄】　　　※要在庫確認",{"v":0,"d":"0 "},{"v":7.7,"d":"8 "},{"v":0,"d":"0 "},{"v":0,"d":"0 "},{"v":0,"d":"0 "},{"$nulls":3},45827,"","2025-06-19","木"]
[{"$f":"IF(B82=\"\",\"\",(COUNTIF($B$2:B82,B82)))","v":""},"","Gウォーク　３２４【黄】　　※要在庫確認","W240  L914　すき間塞ぎなしタイプ",{"$f":"入力!I85","v":0},"　布板・コーナーステップ","Ｇウォーク","ACG324",{"v":4.7,"d":"4.70"},null,null,"","","",null,"ACG324","Gウォーク　３２４【黄】　　※要在庫確認",{"v":0,"d":"0 "},{"v":4.7,"d":"5 "},{"v":0,"d":"0 "},{"v":0,"d":"0 "},{"v":0,"d":"0 "},{"$nulls":3},45828,"","2025-06-20","金"]
[{"$f":"IF(B83=\"\",\"\",(COUNTIF($B$2:B83,B83)))","v":""},"","Ｇウォーク　Ｎ２【青】　　　※要在庫確認","W490  L610　すき間塞ぎなしタイプ",{"$f":"入力!I86","v":0},"　布板・コーナーステップ","Ｇウォーク","ACG2",{"v":5.9,"d":"5.90"},null,null,"","","",null,"ACG2","Ｇウォーク　Ｎ２【青】　　　※要在庫確認",{"v":0,"d":"0 "},{"v":5.9,"d":"6 "},{"v":0,"d":"0 "},{"v":0,"d":"0 "},{"v":0,"d":"0 "},{"$nulls":3},45829,"*","2025-06-21","土","休業日"]
[{"$f":"IF(B84=\"\",\"\",(COUNTIF($B$2:B84,B84)))","v":""},"","Ｇウォーク　２２４【青】　　※要在庫確認","W240  L610　すき間塞ぎなしタイプ",{"$f":"入力!I87","v":0},"　布板・コーナーステップ","Ｇウォーク","ACG224",{"v":3.8,"d":"3.80"},null,null,"","","",null,"ACG224","Ｇウォーク　２２４【青】　　※要在庫確認",{"v":0,"d":"0 "},{"v":3.8,"d":"4 "},{"v":0,"d":"0 "},{"v":0,"d":"0 "},{"$nulls":4},45830,"*","2025-06-22","日","休業日"]
[{"$f":"IF(B85=\"\",\"\",(COUNTIF($B$2:B85,B85)))","v":""},"","ＳＰすき間ステップ","W490  L500　コーナー用",{"$f":"入力!I88","v":0},"　布板・コーナーステップ","すき間ステップ・コーナーステップ","SKSP",{"v":8.3,"d":"8.30"},null,null,"","","",null,"SKSP","ＳＰすき間ステップ",{"v":0,"d":"0 "},{"v":8.3,"d":"8 "},{"v":0,"d":"0 "},{"v":0,"d":"0 "},{"$nulls":4},45831,"","2025-06-23","月"]
[{"$f":"IF(B86=\"\",\"\",(COUNTIF($B$2:B86,B86)))","v":""},"","ＳＰすき間ステップハーフ","W240  L500　コーナー用",{"$f":"入力!I89","v":0},"　布板・コーナーステップ","すき間ステップ・コーナーステップ","SKSP24",{"v":4.6,"d":"4.60"},null,null,"","","",null,"SKSP24","ＳＰすき間ステップハーフ",{"v":0,"d":"0 "},{"v":4.6,"d":"5 "},{"v":0,"d":"0 "},{"v":0,"d":"0 "},{"$nulls":4},45832,"","2025-06-24","火"]
[{"$f":"IF(B87=\"\",\"\",(COUNTIF($B$2:B87,B87)))","v":""},"","コーナーステップ","W490  L220　コーナー用",{"$f":"入力!I90","v":0},"　布板・コーナーステップ","すき間ステップ・コーナーステップ","SKCS",{"v":2.6,"d":"2.60"},null,null,"","","",null,"SKCS","コーナーステップ",{"v":0,"d":"0 "},{"v":2.6,"d":"3 "},{"v":0,"d":"0 "},{"v":0,"d":"0 "},{"v":0,"d":"0 "},{"$nulls":3},45833,"","2025-06-25","水"]
[{"$f":"IF(B88=\"\",\"\",(COUNTIF($B$2:B88,B88)))","v":""},"","コーナーステップ２４","W240  L220　コーナー用",{"$f":"入力!I91","v":0},"　布板・コーナーステップ","すき間ステップ・コーナーステップ","SKCS24",{"v":1.5,"d":"1.50"},null,null,"","","",null,"SKCS24","コーナーステップ２４",{"v":0,"d":"0 "},{"v":1.5,"d":"2 "},{"v":0,"d":"0 "},{"v":0,"d":"0 "},{"v":0,"d":"0 "},{"$nulls":3},45834,"","2025-06-26","木"]
[{"$f":"IF(B89=\"\",\"\",(COUNTIF($B$2:B89,B89)))","v":""},"","ＹＴすき間板０６","L606 W440　ステージ用",{"$f":"入力!I92","v":0},"　布板・コーナーステップ","すき間ステップ・コーナーステップ","YTSK06",{"v":4.2,"d":"4.20"},null,null,"","","",null,"YTSK06","ＹＴすき間板０６",{"v":0,"d":"0 "},{"v":4.2,"d":"4 "},{"v":0,"d":"0 "},{"v":0,"d":"0 "},{"v":0,"d":"0 "},{"$nulls":3},45835,"","2025-06-27","金"]
[{"$f":"IF(B90=\"\",\"\",(COUNTIF($B$2:B90,B90)))","v":""},"","ＹＴすき間板０９","L910 W440　ステージ用",{"$f":"入力!I93","v":0},"　布板・コーナーステップ","すき間ステップ・コーナーステップ","YTSK09",{"v":6.3,"d":"6.30"},null,null,"","","",null,"YTSK09","ＹＴすき間板０９",{"v":0,"d":"0 "},{"v":6.3,"d":"6 "},{"v":0,"d":"0 "},{"v":0,"d":"0 "},{"v":0,"d":"0 "},{"$nulls":3},45836,"*","2025-06-28","土","休業日"]
[{"$f":"IF(B91=\"\",\"\",(COUNTIF($B$2:B91,B91)))","v":""},"","法面２号本体１２型【黄】","L1380 W720（内570）取付角度20～70°",{"$f":"入力!I94","v":0},"　ハシゴ・キャタツ・法面階段","法面階段・ハイステップ","YVK12",{"v":15,"d":"15.00"},null,null,"","","",null,"YVK12","法面２号本体１２型【黄】",{"v":0,"d":"0 "},{"v":15,"d":"15 "},{"v":0,"d":"0 "},{"v":0,"d":"0 "},{"v":0,"d":"0 "},{"$nulls":3},45837,"*","2025-06-29","日","休業日"]
[{"$f":"IF(B92=\"\",\"\",(COUNTIF($B$2:B92,B92)))","v":""},"","法面２号手すり１２型【黄】","本体1に対し左右で2本使用",{"$f":"入力!I95","v":0},"　ハシゴ・キャタツ・法面階段","法面階段・ハイステップ","YVKT12",{"v":3.3,"d":"3.30"},null,null,"","","",null,"YVKT12","法面２号手すり１２型【黄】",{"v":0,"d":"0 "},{"v":3.3,"d":"3 "},{"v":0,"d":"0 "},{"v":0,"d":"0 "},{"v":0,"d":"0 "},{"$nulls":3},45838,"","2025-06-30","月"]
[{"$f":"IF(B93=\"\",\"\",(COUNTIF($B$2:B93,B93)))","v":""},"","法面２号本体２０型【黄緑】","L2415 W720（内570）取付角度20～70°",{"$f":"入力!I96","v":0},"　ハシゴ・キャタツ・法面階段","法面階段・ハイステップ","YVK20",{"v":22.5,"d":"22.50"},null,null,"","","",null,"YVK20","法面２号本体２０型【黄緑】",{"v":0,"d":"0 "},{"v":22.5,"d":"23 "},{"v":0,"d":"0 "},{"v":0,"d":"0 "},{"v":0,"d":"0 "},{"$nulls":3},45839,"","2025-07-01","火"]
[{"$f":"IF(B94=\"\",\"\",(COUNTIF($B$2:B94,B94)))","v":""},"","法面２号手すり２０型【黄緑】","本体1に対し左右で2本使用",{"$f":"入力!I97","v":0},"　ハシゴ・キャタツ・法面階段","法面階段・ハイステップ","YVKT20",{"v":4.2,"d":"4.20"},null,null,"","","",null,"YVKT20","法面２号手すり２０型【黄緑】",{"v":0,"d":"0 "},{"v":4.2,"d":"4 "},{"v":0,"d":"0 "},{"v":0,"d":"0 "},{"v":0,"d":"0 "},{"$nulls":3},45840,"","2025-07-02","水"]
[{"$f":"IF(B95=\"\",\"\",(COUNTIF($B$2:B95,B95)))","v":""},"","法面２号本体３０型【ピンク】","L3105 W720（内570）取付角度20～70°",{"$f":"入力!I98","v":0},"　ハシゴ・キャタツ・法面階段","法面階段・ハイステップ","YVK30",{"v":28.5,"d":"28.50"},null,null,"","","",null,"YVK30","法面２号本体３０型【ピンク】",{"v":0,"d":"0 "},{"v":28.5,"d":"29 "},{"v":0,"d":"0 "},{"v":0,"d":"0 "},{"v":0,"d":"0 "},{"$nulls":3},45841,"","2025-07-03","木"]
[{"$f":"IF(B96=\"\",\"\",(COUNTIF($B$2:B96,B96)))","v":""},"","法面２号手すり３０型【ピンク】","本体1に対し左右で2本使用",{"$f":"入力!I99","v":0},"　ハシゴ・キャタツ・法面階段","法面階段・ハイステップ","YVKT30",{"v":4.8,"d":"4.80"},null,null,"","","",null,"YVKT30","法面２号手すり３０型【ピンク】",{"v":0,"d":"0 "},{"v":4.8,"d":"5 "},{"v":0,"d":"0 "},{"v":0,"d":"0 "},{"v":0,"d":"0 "},{"$nulls":3},45842,"","2025-07-04","金"]
[{"$f":"IF(B97=\"\",\"\",(COUNTIF($B$2:B97,B97)))","v":""},"","ハイステップ　６００","W678（ステップ巾：553）",{"$f":"入力!I100","v":0},"　ハシゴ・キャタツ・法面階段","法面階段・ハイステップ","XU2",{"v":5.2,"d":"5.20"},null,null,"","","",null,"XU2","ハイステップ　６００",{"v":0,"d":"0 "},{"v":5.2,"d":"5 "},{"v":0,"d":"0 "},{"v":0,"d":"0 "},{"v":0,"d":"0 "},{"$nulls":3},45843,"*","2025-07-05","土","休業日"]
[{"$f":"IF(B98=\"\",\"\",(COUNTIF($B$2:B98,B98)))","v":""},"","ハイステップ　９００","W995（ステップ巾：870）",{"$f":"入力!I101","v":0},"　ハシゴ・キャタツ・法面階段","法面階段・ハイステップ","XU3",{"v":6.1,"d":"6.10"},null,null,"","","",null,"XU3","ハイステップ　９００",{"v":0,"d":"0 "},{"v":6.1,"d":"6 "},{"v":0,"d":"0 "},{"v":0,"d":"0 "},{"v":0,"d":"0 "},{"$nulls":3},45844,"*","2025-07-06","日","休業日"]
[{"$f":"IF(B99=\"\",\"\",(COUNTIF($B$2:B99,B99)))","v":""},"","アルスピーダー固定金具","φ42.7・φ48.6兼用",{"$f":"入力!I102","v":0},"　巾木","アルスピーダー","ACHKK",{"v":0.6,"d":"0.60"},30,null,"","","",null,"ACHKK","アルスピーダー固定金具",{"v":0,"d":"0 "},{"v":0.6,"d":"1 "},{"v":0,"d":"0 "},{"v":30,"d":"30 "},{"$f":"ROUNDDOWN(R99/U99,0)","v":{"v":0,"d":"0 "}},{"$nulls":3},45845,"","2025-07-07","月"]
[{"$f":"IF(B100=\"\",\"\",(COUNTIF($B$2:B100,B100)))","v":""},"","アルスピーダー固定金具外コーナー","外コーナー（外側用）",{"$f":"入力!I103","v":0},"　巾木","アルスピーダー","ACHKKS",{"v":1.8,"d":"1.80"},5,null,"","","",null,"ACHKKS","アルスピーダー固定金具外コーナー",{"v":0,"d":"0 "},{"v":1.8,"d":"2 "},{"v":0,"d":"0 "},{"v":5,"d":"5 "},{"v":0,"d":"0 "},{"$nulls":3},45846,"","2025-07-08","火"]
[{"$f":"IF(B101=\"\",\"\",(COUNTIF($B$2:B101,B101)))","v":""},"","アルスピーダー固定金具内コーナー","内コーナー（躯体側用）",{"$f":"入力!I104","v":0},"　巾木","アルスピーダー","ACHKKU",{"v":1.8,"d":"1.80"},5,null,"","","",null,"ACHKKU","アルスピーダー固定金具内コーナー",{"v":0,"d":"0 "},{"v":1.8,"d":"2 "},{"v":0,"d":"0 "},{"v":5,"d":"5 "},{"v":0,"d":"0 "},{"$nulls":3},45847,"","2025-07-09","水"]
[{"$f":"IF(B102=\"\",\"\",(COUNTIF($B$2:B102,B102)))","v":""},"","アルスピーダー０６妻（幅木）","妻側用　W610　H180",{"$f":"入力!I105","v":0},"　巾木","アルスピーダー","ACHKS06",{"v":0.5,"d":"0.50"},null,null,"","","",null,"ACHKS06","アルスピーダー０６妻（幅木）",{"v":0,"d":"0 "},{"v":0.5,"d":"1 "},{"v":0,"d":"0 "},{"v":0,"d":"0 "},{"v":0,"d":"0 "},{"$nulls":3},45848,"","2025-07-10","木"]
[{"$f":"IF(B103=\"\",\"\",(COUNTIF($B$2:B103,B103)))","v":""},"","アルスピーダー０９妻（幅木）【ピンク】","妻側用　W914　H180",{"$f":"入力!I106","v":0},"　巾木","アルスピーダー","ACHKS09",{"v":0.8,"d":"0.80"},null,null,"","","",null,"ACHKS09","アルスピーダー０９妻（幅木）【ピンク】",{"v":0,"d":"0 "},{"v":0.8,"d":"1 "},{"v":0,"d":"0 "},{"v":0,"d":"0 "},{"v":0,"d":"0 "},{"$nulls":3},45849,"","2025-07-11","金"]
[{"$f":"IF(B104=\"\",\"\",(COUNTIF($B$2:B104,B104)))","v":""},"","アルスピーダー１１妻（幅木）【黄緑】","妻側用　W1107　H180",{"$f":"入力!I107","v":0},"　巾木","アルスピーダー","ACHKS11",{"v":1,"d":"1.00"},null,null,"","","",null,"ACHKS11","アルスピーダー１１妻（幅木）【黄緑】",{"v":0,"d":"0 "},{"v":1,"d":"1 "},{"v":0,"d":"0 "},{"v":0,"d":"0 "},{"v":0,"d":"0 "},{"$nulls":3},45850,"*","2025-07-12","土","休業日"]
[{"$f":"IF(B105=\"\",\"\",(COUNTIF($B$2:B105,B105)))","v":""},"","アルスピーダー１２妻（幅木）【青】","妻側用　W1219　H180",{"$f":"入力!I108","v":0},"　巾木","アルスピーダー","ACHKS12",{"v":1.1,"d":"1.10"},null,null,"","","",null,"ACHKS12","アルスピーダー１２妻（幅木）【青】",{"v":0,"d":"0 "},{"v":1.1,"d":"1 "},{"v":0,"d":"0 "},{"v":0,"d":"0 "},{"v":0,"d":"0 "},{"$nulls":3},45851,"*","2025-07-13","日","休業日"]
[{"$f":"IF(B106=\"\",\"\",(COUNTIF($B$2:B106,B106)))","v":""},"","アルスピーダー２０（幅木）","L2000　H180",{"$f":"入力!I109","v":0},"　巾木","アルスピーダー","ACHKS20",{"v":1.8,"d":"1.80"},null,null,"","","",null,"ACHKS20","アルスピーダー２０（幅木）",{"v":0,"d":"0 "},{"v":1.8,"d":"2 "},{"v":0,"d":"0 "},{"v":0,"d":"0 "},{"v":0,"d":"0 "},{"$nulls":3},45852,"","2025-07-14","月"]
[{"$f":"IF(B107=\"\",\"\",(COUNTIF($B$2:B107,B107)))","v":""},"","アルスピーダー４０（幅木）","L4000　H180",{"$f":"入力!I110","v":0},"　巾木","アルスピーダー","ACHKS40",{"v":3.5,"d":"3.50"},null,null,"","","",null,"ACHKS40","アルスピーダー４０（幅木）",{"v":0,"d":"0 "},{"v":3.5,"d":"4 "},{"v":0,"d":"0 "},{"v":0,"d":"0 "},{"v":0,"d":"0 "},{"$nulls":3},45853,"","2025-07-15","火"]
[{"$f":"IF(B108=\"\",\"\",(COUNTIF($B$2:B108,B108)))","v":""},"","２ＷＡＹ０６（Ｌ型開閉幅木）","L610　H180　※妻側用ではありません",{"$f":"入力!I111","v":0},"　巾木","2WAY（L型巾木）","ACHKT06",{"v":2.3,"d":"2.30"},null,null,"","","",null,"ACHKT06","２ＷＡＹ０６（Ｌ型開閉幅木）",{"v":0,"d":"0 "},{"v":2.3,"d":"2 "},{"v":0,"d":"0 "},{"v":0,"d":"0 "},{"v":0,"d":"0 "},{"$nulls":3},45854,"","2025-07-16","水"]
[{"$f":"IF(B109=\"\",\"\",(COUNTIF($B$2:B109,B109)))","v":""},"","２ＷＡＹ０９（Ｌ型開閉幅木）【黄】","L914　H180　※妻側用ではありません",{"$f":"入力!I112","v":0},"　巾木","2WAY（L型巾木）","ACHKT09",{"v":3,"d":"3.00"},null,null,"","","",null,"ACHKT09","２ＷＡＹ０９（Ｌ型開閉幅木）【黄】",{"v":0,"d":"0 "},{"v":3,"d":"3 "},{"v":0,"d":"0 "},{"v":0,"d":"0 "},{"v":0,"d":"0 "},{"$nulls":3},45855,"","2025-07-17","木"]
[{"$f":"IF(B110=\"\",\"\",(COUNTIF($B$2:B110,B110)))","v":""},"","２ＷＡＹ１２（Ｌ型開閉幅木）【青】","L1219　H180　※妻側用ではありません",{"$f":"入力!I113","v":0},"　巾木","2WAY（L型巾木）","ACHKT12",{"v":3.7,"d":"3.70"},null,null,"","","",null,"ACHKT12","２ＷＡＹ１２（Ｌ型開閉幅木）【青】",{"v":0,"d":"0 "},{"v":3.7,"d":"4 "},{"v":0,"d":"0 "},{"v":0,"d":"0 "},{"v":0,"d":"0 "},{"$nulls":3},45856,"","2025-07-18","金"]
[{"$f":"IF(B111=\"\",\"\",(COUNTIF($B$2:B111,B111)))","v":""},"","２ＷＡＹ１５（Ｌ型開閉幅木）【黄】","L1524　H180",{"$f":"入力!I114","v":0},"　巾木","2WAY（L型巾木）","ACHKT15",{"v":4.4,"d":"4.40"},null,null,"","","",null,"ACHKT15","２ＷＡＹ１５（Ｌ型開閉幅木）【黄】",{"v":0,"d":"0 "},{"v":4.4,"d":"4 "},{"v":0,"d":"0 "},{"v":0,"d":"0 "},{"$nulls":4},45857,"*","2025-07-19","土","休業日"]
[{"$f":"IF(B112=\"\",\"\",(COUNTIF($B$2:B112,B112)))","v":""},"","２ＷＡＹ１８（Ｌ型開閉幅木）","L1829　H180",{"$f":"入力!I115","v":0},"　巾木","2WAY（L型巾木）","ACHKT18",{"v":5.1,"d":"5.10"},null,null,"","","",null,"ACHKT18","２ＷＡＹ１８（Ｌ型開閉幅木）",{"v":0,"d":"0 "},{"v":5.1,"d":"5 "},{"v":0,"d":"0 "},{"v":0,"d":"0 "},{"$nulls":4},45858,"*","2025-07-20","日","休業日"]
[{"$f":"IF(B113=\"\",\"\",(COUNTIF($B$2:B113,B113)))","v":""},"","２ＷＡＹ妻側１２（L型幅木）","妻側用　W1219　H160",{"$f":"入力!I116","v":0},"　巾木","2WAY（L型巾木）","ACE2W12",4.64,null,null,"","","",null,"ACE2W12","２ＷＡＹ妻側１２（L型幅木）",{"v":0,"d":"0 "},{"v":4.64,"d":"5 "},{"v":0,"d":"0 "},{"v":0,"d":"0 "},{"$nulls":4},45859,"*","2025-07-21","月","祝日"]
[{"$f":"IF(B114=\"\",\"\",(COUNTIF($B$2:B114,B114)))","v":""},"","２ＷＡＹ妻側６９（L型幅木）","妻側用　W600～914　H160",{"$f":"入力!I117","v":0},"　巾木","2WAY（L型巾木）","ACE2W69",3.86,null,null,"","","",null,"ACE2W69","２ＷＡＹ妻側６９（L型幅木）",{"v":0,"d":"0 "},{"v":3.86,"d":"4 "},{"v":0,"d":"0 "},{"v":0,"d":"0 "},{"$nulls":4},45860,"","2025-07-22","火"]
[{"$f":"IF(B115=\"\",\"\",(COUNTIF($B$2:B115,B115)))","v":""},"","パイプジャッキベース","□140　調整長100～345",{"$f":"入力!I118","v":0},"　ジャッキベース・大引受ジャッキ","ジャッキベース・大引受ジャッキ","AJP",{"v":2.7,"d":"2.70"},null,null,"","","",null,"AJP","パイプジャッキベース",{"v":0,"d":"0 "},{"v":2.7,"d":"3 "},{"v":0,"d":"0 "},{"v":0,"d":"0 "},{"$nulls":4},45861,"","2025-07-23","水"]
[{"$f":"IF(B116=\"\",\"\",(COUNTIF($B$2:B116,B116)))","v":""},"","自在ジャッキ","□140　調節長100～250",{"$f":"入力!I119","v":0},"　ジャッキベース・大引受ジャッキ","ジャッキベース・大引受ジャッキ","PIJ",{"v":3.6,"d":"3.60"},null,null,"","","",null,"PIJ","自在ジャッキ",{"v":0,"d":"0 "},{"v":3.6,"d":"4 "},{"v":0,"d":"0 "},{"v":0,"d":"0 "},{"$nulls":4},45862,"","2025-07-24","木"]
[{"$f":"IF(B117=\"\",\"\",(COUNTIF($B$2:B117,B117)))","v":""},"","ピポットジャッキ","□120×150調節長100～250",{"$f":"入力!I120","v":0},"　ジャッキベース・大引受ジャッキ","ジャッキベース・大引受ジャッキ","X0094",{"v":3.5,"d":"3.50"},null,null,"","","",null,"X0094","ピポットジャッキ",{"v":0,"d":"0 "},{"v":3.5,"d":"4 "},{"v":0,"d":"0 "},{"v":0,"d":"0 "},{"$nulls":4},45863,"","2025-07-25","金"]
[{"$f":"IF(B118=\"\",\"\",(COUNTIF($B$2:B118,B118)))","v":""},"","大引受ジャッキ","□150　調節長100～250",{"$f":"入力!I121","v":0},"　ジャッキベース・大引受ジャッキ","ジャッキベース・大引受ジャッキ","AO752",{"v":5.1,"d":"5.10"},null,null,"","","",null,"AO752","大引受ジャッキ",{"v":0,"d":"0 "},{"v":5.1,"d":"5 "},{"v":0,"d":"0 "},{"v":0,"d":"0 "},{"$nulls":4},45864,"*","2025-07-26","土","休業日"]
[{"$f":"IF(B119=\"\",\"\",(COUNTIF($B$2:B119,B119)))","v":""},"","大引受ジャッキ　ロング","□150　調節長100～450",{"$f":"入力!I122","v":0},"　ジャッキベース・大引受ジャッキ","ジャッキベース・大引受ジャッキ","AO752L",{"v":6.5,"d":"6.50"},null,null,"","","",null,"AO752L","大引受ジャッキ　ロング",{"v":0,"d":"0 "},{"v":6.5,"d":"7 "},{"v":0,"d":"0 "},{"v":0,"d":"0 "},{"$nulls":4},45865,"*","2025-07-27","日","休業日"]
[{"$f":"IF(B120=\"\",\"\",(COUNTIF($B$2:B120,B120)))","v":""},"","３Ｔダブル大引受ジャッキ","□140×210　調節長100～350",{"$f":"入力!I123","v":0},"　ジャッキベース・大引受ジャッキ","ジャッキベース・大引受ジャッキ","HOJ",{"v":5.8,"d":"5.80"},null,null,"","","",null,"HOJ","３Ｔダブル大引受ジャッキ",{"v":0,"d":"0 "},{"v":5.8,"d":"6 "},{"v":0,"d":"0 "},{"v":0,"d":"0 "},{"$nulls":4},45866,"","2025-07-28","月"]
[{"$f":"IF(B121=\"\",\"\",(COUNTIF($B$2:B121,B121)))","v":""},"","シキカク（２０×３０）","W200  L300　ｔ35",{"$f":"入力!I124","v":0},"　敷板","敷板","US033",{"v":1.2,"d":"1.20"},null,null,"","","",null,"US033","シキカク（２０×３０）",{"v":0,"d":"0 "},{"v":1.2,"d":"1 "},{"v":0,"d":"0 "},{"v":0,"d":"0 "},{"$nulls":4},45867,"","2025-07-29","火"]
[{"$f":"IF(B122=\"\",\"\",(COUNTIF($B$2:B122,B122)))","v":""},"","杉　敷板　２Ｍ　（Ｃ級）","W200  L2000　ｔ35",{"$f":"入力!I125","v":0},"　敷板","敷板","US23",{"v":9,"d":"9.00"},null,null,"","","",null,"US23","杉　敷板　２Ｍ　（Ｃ級）",{"v":0,"d":"0 "},{"v":9,"d":"9 "},{"v":0,"d":"0 "},{"v":0,"d":"0 "},{"$nulls":4},45868,"","2025-07-30","水"]
[{"$f":"IF(B123=\"\",\"\",(COUNTIF($B$2:B123,B123)))","v":""},"","杉　敷板　４Ｍ　（Ｃ級）【ピンク】","W200  L4000　ｔ35",{"$f":"入力!I126","v":0},"　敷板","敷板","US43",{"v":18,"d":"18.00"},null,null,"","","",null,"US43","杉　敷板　４Ｍ　（Ｃ級）【ピンク】",{"v":0,"d":"0 "},{"v":18,"d":"18 "},{"v":0,"d":"0 "},{"v":0,"d":"0 "},{"$nulls":4},45869,"","2025-07-31","木"]
[{"$f":"IF(B124=\"\",\"\",(COUNTIF($B$2:B124,B124)))","v":""},"","壁つなぎ控え（H形鋼用）","フランジ：125～310用",{"$f":"入力!I127","v":0},"　壁つなぎ","壁つなぎ","NKH",{"v":1.5,"d":"1.50"},null,null,"","","",null,"NKH","壁つなぎ控え（H形鋼用）",{"v":0,"d":"0 "},{"v":1.5,"d":"2 "},{"v":0,"d":"0 "},{"v":0,"d":"0 "},{"$nulls":4},45870,"","2025-08-01","金"]
[{"$f":"IF(B125=\"\",\"\",(COUNTIF($B$2:B125,B125)))","v":""},"","壁つなぎＮＫ１４１６","L140～160",{"$f":"入力!I128","v":0},"　壁つなぎ","壁つなぎ","NK1416",{"v":0.8,"d":"0.80"},20,null,"","","",null,"NK1416","壁つなぎＮＫ１４１６",{"v":0,"d":"0 "},{"v":0.8,"d":"1 "},{"v":0,"d":"0 "},{"v":20,"d":"20 "},{"$f":"ROUNDDOWN(R125/U125,0)","v":{"v":0,"d":"0 "}},{"$nulls":3},45871,"*","2025-08-02","土","休業日"]
[{"$f":"IF(B126=\"\",\"\",(COUNTIF($B$2:B126,B126)))","v":""},"","壁つなぎＮＫ１６２０","L160～200",{"$f":"入力!I129","v":0},"　壁つなぎ","壁つなぎ","NK1620",0.85,20,null,"","","",null,"NK1620","壁つなぎＮＫ１６２０",{"v":0,"d":"0 "},{"v":0.85,"d":"1 "},{"v":0,"d":"0 "},{"v":20,"d":"20 "},{"v":0,"d":"0 "},{"$nulls":3},45872,"*","2025-08-03","日","休業日"]
[{"$f":"IF(B127=\"\",\"\",(COUNTIF($B$2:B127,B127)))","v":""},"","壁つなぎＮＫ１９２５","L190～250",{"$f":"入力!I130","v":0},"　壁つなぎ","壁つなぎ","NK1925",0.95,20,null,"","","",null,"NK1925","壁つなぎＮＫ１９２５",{"v":0,"d":"0 "},{"v":0.95,"d":"1 "},{"v":0,"d":"0 "},{"v":20,"d":"20 "},{"v":0,"d":"0 "},{"$nulls":3},45873,"","2025-08-04","月"]
[{"$f":"IF(B128=\"\",\"\",(COUNTIF($B$2:B128,B128)))","v":""},"","壁つなぎＮＫ２４３４","L240～340",{"$f":"入力!I131","v":0},"　壁つなぎ","壁つなぎ","NK2434",{"v":1.1,"d":"1.10"},20,null,"","","",null,"NK2434","壁つなぎＮＫ２４３４",{"v":0,"d":"0 "},{"v":1.1,"d":"1 "},{"v":0,"d":"0 "},{"v":20,"d":"20 "},{"v":0,"d":"0 "},{"$nulls":3},45874,"","2025-08-05","火"]
[{"$f":"IF(B129=\"\",\"\",(COUNTIF($B$2:B129,B129)))","v":""},"","壁つなぎＮＫ３３５２","L330～520",{"$f":"入力!I132","v":0},"　壁つなぎ","壁つなぎ","NK3352",{"v":1.4,"d":"1.40"},15,null,"","","",null,{"$f":"IF(E129=\"0\",\"\",H129)","v":"NK3352"},{"$f":"IF(E129=\"0\",\"\",C129)","v":"壁つなぎＮＫ３３５２"},{"v":0,"d":"0 "},{"v":1.4,"d":"1 "},{"v":0,"d":"0 "},{"v":15,"d":"15 "},{"v":0,"d":"0 "},{"$nulls":3},45875,"","2025-08-06","水"]
[{"$f":"IF(B130=\"\",\"\",(COUNTIF($B$2:B130,B130)))","v":""},"","壁つなぎＮＫ５０７２","L500～720",{"$f":"入力!I133","v":0},"　壁つなぎ","壁つなぎ","NK5072",{"v":1.8,"d":"1.80"},10,null,{"$f":"IFERROR(VLOOKUP(K130,$A$2:$E$999,3,FALSE),\"\")","v":""},{"$f":"IFERROR(VLOOKUP(K130,$A$2:$E$99,4,FALSE),\"\")","v":""},{"$f":"IFERROR(VLOOKUP(K130,$A$2:$E$499,5,FALSE),\"\")","v":""},null,"NK5072","壁つなぎＮＫ５０７２",{"$f":"IF(E130=\"\",\"\",E130)","v":{"v":0,"d":"0 "}},{"$f":"IF(E130=\"\",0,I130)","v":{"v":1.8,"d":"2 "}},{"v":0,"d":"0 "},{"$f":"IF(E130=\"0\",\"\",J130)","v":{"v":10,"d":"10 "}},{"v":0,"d":"0 "},{"$nulls":3},45876,"","2025-08-07",{"$f":"TEXT(AB130,\"aaa\")","v":"木"}]
[{"$f":"IF(B131=\"\",\"\",(COUNTIF($B$2:B131,B131)))","v":""},{"$f":"IF(E131,\"1\",\"\")","v":""},"壁つなぎＮＫ７０９２【赤】","L700～920",{"$f":"入力!I134","v":0},"　壁つなぎ","壁つなぎ","NK7092",{"v":2.5,"d":"2.50"},5,null,"","","",null,"NK7092","壁つなぎＮＫ７０９２【赤】",{"v":0,"d":"0 "},{"v":2.5,"d":"3 "},{"$f":"R131*S131","v":{"v":0,"d":"0 "}},{"v":5,"d":"5 "},{"v":0,"d":"0 "},{"$nulls":3},{"$f":"AB131","v":45877},{"$f":"IF(AD131=\"\",\"\",\"*\")","v":""},"2025-08-08","金"]
[{"$f":"IF(B132=\"\",\"\",(COUNTIF($B$2:B132,B132)))","v":""},"","壁つなぎＮＫ９０１１２【青】","L900～1120",{"$f":"入力!I135","v":0},"　壁つなぎ","壁つなぎ","NK90112",2.94,5,null,"","","",null,"NK90112","壁つなぎＮＫ９０１１２【青】",{"v":0,"d":"0 "},{"v":2.94,"d":"3 "},{"v":0,"d":"0 "},{"v":5,"d":"5 "},{"v":0,"d":"0 "},{"$nulls":3},45878,"*",{"$f":"AB131+1","v":"2025-08-09"},"土","休業日"]
[{"$f":"IF(B133=\"\",\"\",(COUNTIF($B$2:B133,B133)))","v":""},"","兼用クランプ（Ｈ）　直交","兼用φ42.7・φ48.6",{"$f":"入力!I136","v":0},"　クランプ類","クランプ・ジョイント・固定ベース","KCC10",0.78,20,null,"","","",null,"KCC10","兼用クランプ（Ｈ）　直交",{"v":0,"d":"0 "},{"v":0.78,"d":"1 "},{"v":0,"d":"0 "},{"v":20,"d":"20 "},{"v":0,"d":"0 "},{"$nulls":3},45879,"*","2025-08-10","日","休業日"]
[{"$f":"IF(B134=\"\",\"\",(COUNTIF($B$2:B134,B134)))","v":""},"","兼用クランプ（Ｈ）　自在","兼用φ42.7・φ48.6",{"$f":"入力!I137","v":0},"　クランプ類","クランプ・ジョイント・固定ベース","KCC11",0.78,20,null,"","","",null,"KCC11","兼用クランプ（Ｈ）　自在",{"v":0,"d":"0 "},{"v":0.78,"d":"1 "},{"v":0,"d":"0 "},{"v":20,"d":"20 "},{"v":0,"d":"0 "},{"$nulls":3},45880,"*","2025-08-11","月","夏季休業日"]
[{"$f":"IF(B135=\"\",\"\",(COUNTIF($B$2:B135,B135)))","v":""},"","ダブルロックジョイント","φ48.6パイプ用",{"$f":"入力!I138","v":0},"　クランプ類","クランプ・ジョイント・固定ベース","PSP",{"v":0.6,"d":"0.60"},30,null,"","","",null,"PSP","ダブルロックジョイント",{"v":0,"d":"0 "},{"v":0.6,"d":"1 "},{"v":0,"d":"0 "},{"v":30,"d":"30 "},{"v":0,"d":"0 "},{"$nulls":3},45881,"*","2025-08-12","火","夏季休業日"]
[{"$f":"IF(B136=\"\",\"\",(COUNTIF($B$2:B136,B136)))","v":""},"","固定ベース","□120　φ48.6　",{"$f":"入力!I139","v":0},"　クランプ類","クランプ・ジョイント・固定ベース","PK",0.85,20,null,"","","",null,"PK","固定ベース",{"v":0,"d":"0 "},{"v":0.85,"d":"1 "},{"v":0,"d":"0 "},{"v":20,"d":"20 "},{"v":0,"d":"0 "},{"$nulls":3},45882,"*","2025-08-13","水","夏季休業日"]
[{"$f":"IF(B137=\"\",\"\",(COUNTIF($B$2:B137,B137)))","v":""},"","回転ベース","□120　φ48.6　",{"$f":"入力!I140","v":0},"　クランプ類","クランプ・ジョイント・固定ベース","PKJ",1.17,20,null,"","","",null,"PKJ","回転ベース",{"v":0,"d":"0 "},{"v":1.17,"d":"1 "},{"v":0,"d":"0 "},{"v":20,"d":"20 "},{"v":0,"d":"0 "},{"$nulls":3},45883,"*","2025-08-14","木","夏季休業日"]
[{"$f":"IF(B138=\"\",\"\",(COUNTIF($B$2:B138,B138)))","v":""},"","鉄骨スイッチクランプ　固定","掴み：0～40　兼用φ42.7・φ48.6",{"$f":"入力!I141","v":0},"　クランプ類","クランプ・ジョイント・固定ベース","CKMK20",{"v":1.1,"d":"1.10"},20,null,"","","",null,"CKMK20","鉄骨スイッチクランプ　固定",{"v":0,"d":"0 "},{"v":1.1,"d":"1 "},{"v":0,"d":"0 "},{"v":20,"d":"20 "},{"v":0,"d":"0 "},{"$nulls":3},45884,"*","2025-08-15","金","夏季休業日"]
[{"$f":"IF(B139=\"\",\"\",(COUNTIF($B$2:B139,B139)))","v":""},"","鉄骨スイッチクランプ　自在","掴み：0～40　兼用φ42.7・φ48.6",{"$f":"入力!I142","v":0},"　クランプ類","クランプ・ジョイント・固定ベース","CKMK21",{"v":1.1,"d":"1.10"},20,null,"","","",null,"CKMK21","鉄骨スイッチクランプ　自在",{"v":0,"d":"0 "},{"v":1.1,"d":"1 "},{"v":0,"d":"0 "},{"v":20,"d":"20 "},{"v":0,"d":"0 "},{"$nulls":3},45885,"*","2025-08-16","土","休業日"]
[{"$f":"IF(B140=\"\",\"\",(COUNTIF($B$2:B140,B140)))","v":""},"","座マルキャッチ100","掴み：6～100　兼用φ42.7・φ48.6",{"$f":"入力!I143","v":0},"　クランプ類","クランプ・ジョイント・固定ベース","CKMKL100",{"v":2.1,"d":"2.10"},10,null,"","","",null,"CKMKL100","座マルキャッチ100",{"v":0,"d":"0 "},{"v":2.1,"d":"2 "},{"v":0,"d":"0 "},{"v":10,"d":"10 "},{"v":0,"d":"0 "},{"$nulls":3},45886,"*","2025-08-17","日","休業日"]
[{"$f":"IF(B141=\"\",\"\",(COUNTIF($B$2:B141,B141)))","v":""},"","単管パイプ　０．６Ｍ　バタ","ピン無しバタ",{"$f":"入力!I144","v":0},"　単管パイプ","単管パイプ","PP06",{"v":1.638,"d":"1.64"},null,null,"","","",null,"PP06","単管パイプ　０．６Ｍ　バタ",{"v":0,"d":"0 "},{"v":1.638,"d":"2 "},{"v":0,"d":"0 "},{"v":0,"d":"0 "},{"$f":"T141*U141","v":{"v":0,"d":"0 "}},{"$nulls":3},45887,"","2025-08-18","月"]
[{"$f":"IF(B142=\"\",\"\",(COUNTIF($B$2:B142,B142)))","v":""},"","単管パイプ　１．２Ｍ　バタ","ピン無しバタ",{"$f":"入力!I145","v":0},"　単管パイプ","単管パイプ","PP12",{"v":3.276,"d":"3.28"},null,null,"","","",null,"PP12","単管パイプ　１．２Ｍ　バタ",{"v":0,"d":"0 "},{"v":3.276,"d":"3 "},{"v":0,"d":"0 "},{"v":0,"d":"0 "},{"v":0,"d":"0 "},{"$nulls":3},45888,"","2025-08-19","火"]
[{"$f":"IF(B143=\"\",\"\",(COUNTIF($B$2:B143,B143)))","v":""},"","単管パイプ　１．０Ｍ　ピン付","スーパーライト",{"$f":"入力!I146","v":0},"　単管パイプ","単管パイプ","PP10",2.08,null,null,"","","",null,"PP10","単管パイプ　１．０Ｍ　ピン付",{"v":0,"d":"0 "},{"v":2.08,"d":"2 "},{"v":0,"d":"0 "},{"v":0,"d":"0 "},{"v":0,"d":"0 "},{"$nulls":3},{"$f":"AB143","v":45889},"","2025-08-20","水"]
[{"$f":"IF(B144=\"\",\"\",(COUNTIF($B$2:B144,B144)))","v":""},"","単管パイプ　１．５Ｍ　ピン付","スーパーライト",{"$f":"入力!I147","v":0},"　単管パイプ","単管パイプ","PP15",3.12,null,null,"","","",null,"PP15","単管パイプ　１．５Ｍ　ピン付",{"v":0,"d":"0 "},{"v":3.12,"d":"3 "},{"v":0,"d":"0 "},{"v":0,"d":"0 "},{"v":0,"d":"0 "},{"$nulls":3},{"$f":"AB144","v":45890},"","2025-08-21","木"]
[{"$f":"IF(B145=\"\",\"\",(COUNTIF($B$2:B145,B145)))","v":""},"","単管パイプ　２．０Ｍ　ピン付","スーパーライト",{"$f":"入力!I148","v":0},"　単管パイプ","単管パイプ","PP20",4.16,null,null,"","","",null,"PP20","単管パイプ　２．０Ｍ　ピン付",{"v":0,"d":"0 "},{"v":4.16,"d":"4 "},{"v":0,"d":"0 "},{"v":0,"d":"0 "},{"v":0,"d":"0 "},{"$nulls":4},"","2025-08-22","金"]
[{"$f":"IF(B146=\"\",\"\",(COUNTIF($B$2:B146,B146)))","v":""},"","単管パイプ　２．５Ｍ　ピン付","スーパーライト",{"$f":"入力!I149","v":0},"　単管パイプ","単管パイプ","PP25",{"v":5.2,"d":"5.20"},null,null,"","","",null,"PP25","単管パイプ　２．５Ｍ　ピン付",{"v":0,"d":"0 "},{"v":5.2,"d":"5 "},{"v":0,"d":"0 "},{"v":0,"d":"0 "},{"v":0,"d":"0 "},{"$nulls":4},"*","2025-08-23","土","休業日"]
[{"$f":"IF(B147=\"\",\"\",(COUNTIF($B$2:B147,B147)))","v":""},"","単管パイプ　３．０Ｍ　ピン付","スーパーライト",{"$f":"入力!I150","v":0},"　単管パイプ","単管パイプ","PP30",6.24,null,null,"","","",null,"PP30","単管パイプ　３．０Ｍ　ピン付",{"v":0,"d":"0 "},{"v":6.24,"d":"6 "},{"v":0,"d":"0 "},{"v":0,"d":"0 "},{"v":0,"d":"0 "},{"$nulls":4},"*","2025-08-24","日","休業日"]
[{"$f":"IF(B148=\"\",\"\",(COUNTIF($B$2:B148,B148)))","v":""},"","単管パイプ　３．５Ｍ　ピン付","スーパーライト",{"$f":"入力!I151","v":0},"　単管パイプ","単管パイプ","PP35",7.28,null,null,"","","",null,"PP35","単管パイプ　３．５Ｍ　ピン付",{"v":0,"d":"0 "},{"v":7.28,"d":"7 "},{"v":0,"d":"0 "},{"v":0,"d":"0 "},{"v":0,"d":"0 "},{"$nulls":4},"","2025-08-25","月"]
[{"$f":"IF(B149=\"\",\"\",(COUNTIF($B$2:B149,B149)))","v":""},"","単管パイプ　４．０Ｍ　ピン付","スーパーライト",{"$f":"入力!I152","v":0},"　単管パイプ","単管パイプ","PP40",8.32,null,null,"","","",null,"PP40","単管パイプ　４．０Ｍ　ピン付",{"v":0,"d":"0 "},{"v":8.32,"d":"8 "},{"v":0,"d":"0 "},{"v":0,"d":"0 "},{"v":0,"d":"0 "},{"$nulls":4},"","2025-08-26","火"]
[{"$f":"IF(B150=\"\",\"\",(COUNTIF($B$2:B150,B150)))","v":""},"","くい　１．２","打込み用パイプ　φ48.6",{"$f":"入力!I153","v":0},"　単管パイプ","打ち込みパイプ","PUK12",{"v":3.3,"d":"3.30"},null,null,"","","",null,"PUK12","くい　１．２",{"v":0,"d":"0 "},{"v":3.3,"d":"3 "},{"v":0,"d":"0 "},{"v":0,"d":"0 "},{"$nulls":5},"","2025-08-27","水"]
[{"$f":"IF(B151=\"\",\"\",(COUNTIF($B$2:B151,B151)))","v":""},"","結束枠","W500　H405（2枠で1セット）",{"$f":"入力!I154","v":0},"　単管パイプ","結束枠","HZGT",{"v":5.1,"d":"5.10"},null,null,"","","",null,"HZGT","結束枠",{"v":0,"d":"0 "},{"v":5.1,"d":"5 "},{"v":0,"d":"0 "},{"v":0,"d":"0 "},{"$nulls":5},"","2025-08-28","木"]
[{"$f":"IF(B152=\"\",\"\",(COUNTIF($B$2:B152,B152)))","v":""},"","アルミメッシュS","W311  L632　すき間塞ぎ用",{"$f":"入力!I155","v":0},"　足場板","アルミ足場板・すき間塞ぎ板","ALMS",{"v":1.3,"d":"1.30"},null,null,"","","",null,"ALMS","アルミメッシュS",{"v":0,"d":"0 "},{"v":1.3,"d":"1 "},{"v":0,"d":"0 "},{"v":0,"d":"0 "},{"$f":"T152*U152","v":{"v":0,"d":"0 "}},{"$nulls":4},"","2025-08-29","金"]
[{"$f":"IF(B153=\"\",\"\",(COUNTIF($B$2:B153,B153)))","v":""},"","アルミ足場板　０．５Ｍ","W240  L500",{"$f":"入力!I156","v":0},"　足場板","アルミ足場板・すき間塞ぎ板","ACAL05SO",{"v":1.4,"d":"1.40"},null,null,"","","",null,"ACAL05SO","アルミ足場板　０．５Ｍ",{"v":0,"d":"0 "},{"v":1.4,"d":"1 "},{"v":0,"d":"0 "},{"v":0,"d":"0 "},{"v":0,"d":"0 "},{"$nulls":4},"*","2025-08-30","土","休業日"]
[{"$f":"IF(B154=\"\",\"\",(COUNTIF($B$2:B154,B154)))","v":""},"","アルミ足場板　１Ｍ","W240  L1000",{"$f":"入力!I157","v":0},"　足場板","アルミ足場板・すき間塞ぎ板","ACAL10SO",{"v":2.1,"d":"2.10"},null,null,"","","",null,"ACAL10SO","アルミ足場板　１Ｍ",{"v":0,"d":"0 "},{"v":2.1,"d":"2 "},{"v":0,"d":"0 "},{"v":0,"d":"0 "},{"v":0,"d":"0 "},{"$nulls":4},"*","2025-08-31","日","休業日"]
[{"$f":"IF(B155=\"\",\"\",(COUNTIF($B$2:B155,B155)))","v":""},"","アルミ足場板　１．５Ｍ","W240  L1500",{"$f":"入力!I158","v":0},"　足場板","アルミ足場板・すき間塞ぎ板","ACAL15SO",{"v":3.1,"d":"3.10"},null,null,"","","",null,"ACAL15SO","アルミ足場板　１．５Ｍ",{"v":0,"d":"0 "},{"v":3.1,"d":"3 "},{"v":0,"d":"0 "},{"v":0,"d":"0 "},{"v":0,"d":"0 "},{"$nulls":4},"","2025-09-01","月"]
[{"$f":"IF(B156=\"\",\"\",(COUNTIF($B$2:B156,B156)))","v":""},"","アルミ足場板　２Ｍ","W240  L2000",{"$f":"入力!I159","v":0},"　足場板","アルミ足場板・すき間塞ぎ板","ACAL20SO",{"v":6.1,"d":"6.10"},null,null,"","","",null,"ACAL20SO","アルミ足場板　２Ｍ",{"v":0,"d":"0 "},{"v":6.1,"d":"6 "},{"v":0,"d":"0 "},{"v":0,"d":"0 "},{"v":0,"d":"0 "},{"$nulls":4},"","2025-09-02","火"]
[{"$f":"IF(B157=\"\",\"\",(COUNTIF($B$2:B157,B157)))","v":""},"","アルミ足場板　３Ｍ","W240  L3000",{"$f":"入力!I160","v":0},"　足場板","アルミ足場板・すき間塞ぎ板","ACAL30SO",{"v":8.6,"d":"8.60"},null,null,"","","",null,"ACAL30SO","アルミ足場板　３Ｍ",{"v":0,"d":"0 "},{"v":8.6,"d":"9 "},{"v":0,"d":"0 "},{"v":0,"d":"0 "},{"v":0,"d":"0 "},{"$nulls":4},"","2025-09-03","水"]
[{"$f":"IF(B158=\"\",\"\",(COUNTIF($B$2:B158,B158)))","v":""},"","アルミ足場板　４Ｍ","W240  L4000",{"$f":"入力!I161","v":0},"　足場板","アルミ足場板・すき間塞ぎ板","ACAL40SO",{"v":10.1,"d":"10.10"},null,null,"","","",null,"ACAL40SO","アルミ足場板　４Ｍ",{"v":0,"d":"0 "},{"v":10.1,"d":"10 "},{"v":0,"d":"0 "},{"v":0,"d":"0 "},{"v":0,"d":"0 "},{"$nulls":4},"","2025-09-04","木"]
[{"$f":"IF(B159=\"\",\"\",(COUNTIF($B$2:B159,B159)))","v":""},"","アルミ一連梯子３．０Ｍ","W421　H3098",{"$f":"入力!I162","v":0},"　ハシゴ・キャタツ・法面階段","アルミハシゴ・モンキータラップ","ASAL30",{"v":6,"d":"6.00"},null,null,"","","",null,"ASAL30","アルミ一連梯子３．０Ｍ",{"v":0,"d":"0 "},{"v":6,"d":"6 "},{"v":0,"d":"0 "},{"v":0,"d":"0 "},{"v":0,"d":"0 "},{"$nulls":4},"","2025-09-05","金"]
[{"$f":"IF(B160=\"\",\"\",(COUNTIF($B$2:B160,B160)))","v":""},"","アルミ一連梯子４．０Ｍ","W421　H4088",{"$f":"入力!I163","v":0},"　ハシゴ・キャタツ・法面階段","アルミハシゴ・モンキータラップ","ASAL40",{"v":7.5,"d":"7.50"},null,null,"","","",null,"ASAL40","アルミ一連梯子４．０Ｍ",{"v":0,"d":"0 "},{"v":7.5,"d":"8 "},{"v":0,"d":"0 "},{"v":0,"d":"0 "},{"$nulls":5},"*","2025-09-06","土","休業日"]
[{"$f":"IF(B161=\"\",\"\",(COUNTIF($B$2:B161,B161)))","v":""},"","アルミ２連梯子５．０Ｍ","W421　H3150～5160",{"$f":"入力!I164","v":0},"　ハシゴ・キャタツ・法面階段","アルミハシゴ・モンキータラップ","ASALW50",{"v":11.4,"d":"11.40"},null,null,"","","",null,"ASALW50","アルミ２連梯子５．０Ｍ",{"v":0,"d":"0 "},{"v":11.4,"d":"11 "},{"v":0,"d":"0 "},{"v":0,"d":"0 "},{"$nulls":5},"*","2025-09-07","日","休業日"]
[{"$f":"IF(B162=\"\",\"\",(COUNTIF($B$2:B162,B162)))","v":""},"","ジョイント梯子　２．０Ｍ","φ42.7　H2000",{"$f":"入力!I165","v":0},"　ハシゴ・キャタツ・法面階段","アルミハシゴ・モンキータラップ","AS2000",{"v":12.7,"d":"12.70"},null,null,"","","",null,"AS2000","ジョイント梯子　２．０Ｍ",{"v":0,"d":"0 "},{"v":12.7,"d":"13 "},{"v":0,"d":"0 "},{"v":0,"d":"0 "},{"$f":"T162*U162","v":{"v":0,"d":"0 "}},{"$nulls":4},"","2025-09-08","月"]
[{"$f":"IF(B163=\"\",\"\",(COUNTIF($B$2:B163,B163)))","v":""},"","ステップバー６１０","W610　兼用φ42.7・φ48.6",{"$f":"入力!I166","v":0},"　ハシゴ・キャタツ・法面階段","アルミハシゴ・モンキータラップ","ASB610",{"v":1.8,"d":"1.80"},10,null,"","","",null,"ASB610","ステップバー６１０",{"v":0,"d":"0 "},{"v":1.8,"d":"2 "},{"v":0,"d":"0 "},{"v":10,"d":"10 "},{"$f":"ROUNDDOWN(R163/U163,0)","v":{"v":0,"d":"0 "}},{"$nulls":4},"","2025-09-09","火"]
[{"$f":"IF(B164=\"\",\"\",(COUNTIF($B$2:B164,B164)))","v":""},"","モンキーヘッド　（モンキータラップ用最上部手摺）","H650　D250　本体1台に左右で2本使用",{"$f":"入力!I167","v":0},"　ハシゴ・キャタツ・法面階段","アルミハシゴ・モンキータラップ","ASH",{"v":2,"d":"2.00"},5,null,"","","",null,"ASH","モンキーヘッド　（モンキータラップ用最上部手摺）",{"v":0,"d":"0 "},{"v":2,"d":"2 "},{"v":0,"d":"0 "},{"v":5,"d":"5 "},{"v":0,"d":"0 "},{"$nulls":4},"","2025-09-10","水"]
[{"$f":"IF(B165=\"\",\"\",(COUNTIF($B$2:B165,B165)))","v":""},"","モンキータラップ１７００","W400　H1700",{"$f":"入力!I168","v":0},"　ハシゴ・キャタツ・法面階段","アルミハシゴ・モンキータラップ","AS1700",{"v":12,"d":"12.00"},null,null,"","","",null,"AS1700","モンキータラップ１７００",{"v":0,"d":"0 "},{"v":12,"d":"12 "},{"v":0,"d":"0 "},{"v":0,"d":"0 "},{"$f":"T165*U165","v":{"v":0,"d":"0 "}},{"$nulls":4},"","2025-09-11","木"]
[{"$f":"IF(B166=\"\",\"\",(COUNTIF($B$2:B166,B166)))","v":""},"","キャタツ４型Ⅴ","H1190　",{"$f":"入力!I169","v":0},"　ハシゴ・キャタツ・法面階段","キャタツ","GV4",{"v":11.2,"d":"11.20"},null,null,"","","",null,"GV4","キャタツ４型Ⅴ",{"v":0,"d":"0 "},{"v":11.2,"d":"11 "},{"v":0,"d":"0 "},{"v":0,"d":"0 "},{"v":0,"d":"0 "},{"$nulls":4},"","2025-09-12","金"]
[{"$f":"IF(B167=\"\",\"\",(COUNTIF($B$2:B167,B167)))","v":""},"","キャタツ６型Ⅴ","H1735　",{"$f":"入力!I170","v":0},"　ハシゴ・キャタツ・法面階段","キャタツ","GV6",{"v":15.6,"d":"15.60"},null,null,"","","",null,"GV6","キャタツ６型Ⅴ",{"v":0,"d":"0 "},{"v":15.6,"d":"16 "},{"v":0,"d":"0 "},{"v":0,"d":"0 "},{"v":0,"d":"0 "},{"$nulls":4},"*","2025-09-13","土","休業日"]
[{"$f":"IF(B168=\"\",\"\",(COUNTIF($B$2:B168,B168)))","v":""},"","ＳＰサポート10型","320～440　φ48.6×φ60.5",{"$f":"入力!I171","v":0},"　パイプサポート","パイプサポート","SS10SP",{"v":4,"d":"4.00"},null,null,"","","",null,"SS10SP","ＳＰサポート10型",{"v":0,"d":"0 "},{"v":4,"d":"4 "},{"v":0,"d":"0 "},{"v":0,"d":"0 "},{"v":0,"d":"0 "},{"$nulls":4},"*","2025-09-14","日","休業日"]
[{"$f":"IF(B169=\"\",\"\",(COUNTIF($B$2:B169,B169)))","v":""},"","ＳＰサポート15型【ピンク】","410～620　φ48.6×φ60.5",{"$f":"入力!I172","v":0},"　パイプサポート","パイプサポート","SS15SP",{"v":4.5,"d":"4.50"},null,null,"","","",null,"SS15SP","ＳＰサポート15型【ピンク】",{"v":0,"d":"0 "},{"v":4.5,"d":"5 "},{"v":0,"d":"0 "},{"v":0,"d":"0 "},{"v":0,"d":"0 "},{"$nulls":4},"*","2025-09-15","月","祝日"]
[{"$f":"IF(B170=\"\",\"\",(COUNTIF($B$2:B170,B170)))","v":""},"","ＳＰサポート20型【黄緑】","620～940　φ48.6×φ60.5",{"$f":"入力!I173","v":0},"　パイプサポート","パイプサポート","SS20SP",{"v":6,"d":"6.00"},null,null,"","","",null,"SS20SP","ＳＰサポート20型【黄緑】",{"v":0,"d":"0 "},{"v":6,"d":"6 "},{"v":0,"d":"0 "},{"v":0,"d":"0 "},{"v":0,"d":"0 "},{"$nulls":4},"","2025-09-16","火"]
[{"$f":"IF(B171=\"\",\"\",(COUNTIF($B$2:B171,B171)))","v":""},"","ＳＰサポート30型【ピンク】","920～1415　φ48.6×φ60.5",{"$f":"入力!I174","v":0},"　パイプサポート","パイプサポート","SS30SP",{"v":7.5,"d":"7.50"},null,null,"","","",null,"SS30SP","ＳＰサポート30型【ピンク】",{"v":0,"d":"0 "},{"v":7.5,"d":"8 "},{"v":0,"d":"0 "},{"v":0,"d":"0 "},{"v":0,"d":"0 "},{"$nulls":4},"","2025-09-17","水"]
[{"$f":"IF(B172=\"\",\"\",(COUNTIF($B$2:B172,B172)))","v":""},"","ＳＰサポート40型【黄緑】","1220～1995　φ48.6×φ60.5",{"$f":"入力!I175","v":0},"　パイプサポート","パイプサポート","SS40SP",{"v":9.5,"d":"9.50"},null,null,"","","",null,"SS40SP","ＳＰサポート40型【黄緑】",{"v":0,"d":"0 "},{"v":9.5,"d":"10 "},{"v":0,"d":"0 "},{"v":0,"d":"0 "},{"v":0,"d":"0 "},{"$nulls":4},"","2025-09-18","木"]
[{"$f":"IF(B173=\"\",\"\",(COUNTIF($B$2:B173,B173)))","v":""},"","ＳＰサポート60型","1720～3040　φ48.6×φ60.5",{"$f":"入力!I176","v":0},"　パイプサポート","パイプサポート","SS60SP",{"v":12.5,"d":"12.50"},null,null,"","","",null,"SS60SP","ＳＰサポート60型",{"v":0,"d":"0 "},{"v":12.5,"d":"13 "},{"v":0,"d":"0 "},{"v":0,"d":"0 "},{"v":0,"d":"0 "},{"$nulls":4},"*","2025-09-19","金","棚卸し臨時休業"]
[{"$f":"IF(B174=\"\",\"\",(COUNTIF($B$2:B174,B174)))","v":""},"","サポートクランプ　直交","φ48.6×φ60.5",{"$f":"入力!I177","v":0},"　パイプサポート","パイプサポート","CT0",{"v":0.8,"d":"0.80"},20,null,"","","",null,"CT0","サポートクランプ　直交",{"v":0,"d":"0 "},{"v":0.8,"d":"1 "},{"v":0,"d":"0 "},{"v":20,"d":"20 "},{"$f":"ROUNDDOWN(R174/U174,0)","v":{"v":0,"d":"0 "}},{"$nulls":4},"*","2025-09-20","土","休業日"]
[{"$f":"IF(B175=\"\",\"\",(COUNTIF($B$2:B175,B175)))","v":""},"","サポートクランプ　自在","φ48.6×φ60.5",{"$f":"入力!I178","v":0},"　パイプサポート","パイプサポート","CT1",{"v":0.8,"d":"0.80"},20,null,"","","",null,"CT1","サポートクランプ　自在",{"v":0,"d":"0 "},{"v":0.8,"d":"1 "},{"v":0,"d":"0 "},{"v":20,"d":"20 "},{"v":0,"d":"0 "},{"$nulls":4},"*","2025-09-21","日","休業日"]
[{"$f":"IF(B176=\"\",\"\",(COUNTIF($B$2:B176,B176)))","v":""},"","６０角バタ　　　１．０Ｍ　【青】","□60×60×2.3",{"$f":"入力!I179","v":0},"　角パイプ","60角鋼管","KK10",4.06,null,null,"","","",null,"KK10","６０角バタ　　　１．０Ｍ　【青】",{"v":0,"d":"0 "},{"v":4.06,"d":"4 "},{"v":0,"d":"0 "},{"v":0,"d":"0 "},{"$nulls":5},"","2025-09-22","月"]
[{"$f":"IF(B177=\"\",\"\",(COUNTIF($B$2:B177,B177)))","v":""},"","６０角バタ　　　１．５Ｍ　【赤】","□60×60×2.3",{"$f":"入力!I180","v":0},"　角パイプ","60角鋼管","KK15",6.09,null,null,"","","",null,"KK15","６０角バタ　　　１．５Ｍ　【赤】",{"v":0,"d":"0 "},{"v":6.09,"d":"6 "},{"v":0,"d":"0 "},{"v":0,"d":"0 "},{"$f":"T177*U177","v":{"v":0,"d":"0 "}},{"$nulls":4},"*","2025-09-23","火","祝日"]
[{"$f":"IF(B178=\"\",\"\",(COUNTIF($B$2:B178,B178)))","v":""},"","６０角バタ　　　２．０Ｍ　【青】","□60×60×2.3",{"$f":"入力!I181","v":0},"　角パイプ","60角鋼管","KK20",8.12,null,null,"","","",null,"KK20","６０角バタ　　　２．０Ｍ　【青】",{"v":0,"d":"0 "},{"v":8.12,"d":"8 "},{"v":0,"d":"0 "},{"v":0,"d":"0 "},{"$nulls":5},"","2025-09-24","水"]
[{"$f":"IF(B179=\"\",\"\",(COUNTIF($B$2:B179,B179)))","v":""},"","６０角バタ　　　２．５Ｍ　【赤】","□60×60×2.3",{"$f":"入力!I182","v":0},"　角パイプ","60角鋼管","KK25",10.15,null,null,"","","",null,"KK25","６０角バタ　　　２．５Ｍ　【赤】",{"v":0,"d":"0 "},{"v":10.15,"d":"10 "},{"v":0,"d":"0 "},{"v":0,"d":"0 "},{"$nulls":5},"","2025-09-25","木"]
[{"$f":"IF(B180=\"\",\"\",(COUNTIF($B$2:B180,B180)))","v":""},"","６０角バタ　　　３．０Ｍ　【青】","□60×60×2.3",{"$f":"入力!I183","v":0},"　角パイプ","60角鋼管","KK30",12.18,null,null,"","","",null,"KK30","６０角バタ　　　３．０Ｍ　【青】",{"v":0,"d":"0 "},{"v":12.18,"d":"12 "},{"v":0,"d":"0 "},{"v":0,"d":"0 "},{"$nulls":5},"","2025-09-26","金"]
[{"$f":"IF(B181=\"\",\"\",(COUNTIF($B$2:B181,B181)))","v":""},"","６０角バタ　　　３．５Ｍ　【赤】","□60×60×2.3",{"$f":"入力!I184","v":0},"　角パイプ","60角鋼管","KK35",14.21,null,null,"","","",null,"KK35","６０角バタ　　　３．５Ｍ　【赤】",{"v":0,"d":"0 "},{"v":14.21,"d":"14 "},{"v":0,"d":"0 "},{"v":0,"d":"0 "},{"$nulls":5},"*","2025-09-27","土","休業日"]
[{"$f":"IF(B182=\"\",\"\",(COUNTIF($B$2:B182,B182)))","v":""},"","６０角バタ　　　４．０Ｍ　【青】","□60×60×2.3",{"$f":"入力!I185","v":0},"　角パイプ","60角鋼管","KK40",16.24,null,null,"","","",null,"KK40","６０角バタ　　　４．０Ｍ　【青】",{"v":0,"d":"0 "},{"v":16.24,"d":"16 "},{"v":0,"d":"0 "},{"v":0,"d":"0 "},{"$nulls":5},"*","2025-09-28","日","休業日"]
[{"$f":"IF(B183=\"\",\"\",(COUNTIF($B$2:B183,B183)))","v":""},"","１００角バタ　　　１．０Ｍ　【青】","□100×100×3.2",{"$f":"入力!I186","v":0},"　角パイプ","100角鋼管","OO10",9.52,null,null,"","","",null,"OO10","１００角バタ　　　１．０Ｍ　【青】",{"v":0,"d":"0 "},{"v":9.52,"d":"10 "},{"v":0,"d":"0 "},{"v":0,"d":"0 "},{"$nulls":5},"","2025-09-29","月"]
[{"$f":"IF(B184=\"\",\"\",(COUNTIF($B$2:B184,B184)))","v":""},"","１００角バタ　　　１．５Ｍ　【赤】","□100×100×3.2",{"$f":"入力!I187","v":0},"　角パイプ","100角鋼管","OO15",14.28,null,null,"","","",null,"OO15","１００角バタ　　　１．５Ｍ　【赤】",{"v":0,"d":"0 "},{"v":14.28,"d":"14 "},{"v":0,"d":"0 "},{"v":0,"d":"0 "},{"$f":"T184*U184","v":{"v":0,"d":"0 "}},{"$nulls":4},"","2025-09-30","火"]
[{"$f":"IF(B185=\"\",\"\",(COUNTIF($B$2:B185,B185)))","v":""},"","１００角バタ　　　２．０Ｍ　【青】","□100×100×3.2",{"$f":"入力!I188","v":0},"　角パイプ","100角鋼管","OO20",19.04,null,null,"","","",null,"OO20","１００角バタ　　　２．０Ｍ　【青】",{"v":0,"d":"0 "},{"v":19.04,"d":"19 "},{"v":0,"d":"0 "},{"v":0,"d":"0 "},{"v":0,"d":"0 "},{"$nulls":4},"","2025-10-01","水"]
[{"$f":"IF(B186=\"\",\"\",(COUNTIF($B$2:B186,B186)))","v":""},"","１００角バタ　　　２．５Ｍ　【赤】","□100×100×3.2",{"$f":"入力!I189","v":0},"　角パイプ","100角鋼管","OO25",{"v":23.8,"d":"23.80"},null,null,"","","",null,"OO25","１００角バタ　　　２．５Ｍ　【赤】",{"v":0,"d":"0 "},{"v":23.8,"d":"24 "},{"v":0,"d":"0 "},{"v":0,"d":"0 "},{"v":0,"d":"0 "},{"$nulls":4},"","2025-10-02","木"]
[{"$f":"IF(B187=\"\",\"\",(COUNTIF($B$2:B187,B187)))","v":""},"","１００角バタ　　　３．０Ｍ　【青】","□100×100×3.2",{"$f":"入力!I190","v":0},"　角パイプ","100角鋼管","OO30",28.56,null,null,"","","",null,"OO30","１００角バタ　　　３．０Ｍ　【青】",{"v":0,"d":"0 "},{"v":28.56,"d":"29 "},{"v":0,"d":"0 "},{"v":0,"d":"0 "},{"v":0,"d":"0 "},{"$nulls":4},"","2025-10-03","金"]
[{"$f":"IF(B188=\"\",\"\",(COUNTIF($B$2:B188,B188)))","v":""},"","１００角バタ　　　３．５Ｍ　【赤】","□100×100×3.2",{"$f":"入力!I191","v":0},"　角パイプ","100角鋼管","OO35",33.32,null,null,"","","",null,"OO35","１００角バタ　　　３．５Ｍ　【赤】",{"v":0,"d":"0 "},{"v":33.32,"d":"33 "},{"v":0,"d":"0 "},{"v":0,"d":"0 "},{"v":0,"d":"0 "},{"$nulls":4},"*","2025-10-04","土","休業日"]
[{"$f":"IF(B189=\"\",\"\",(COUNTIF($B$2:B189,B189)))","v":""},"","１００角バタ　　　４．０Ｍ　【青】","□100×100×3.2",{"$f":"入力!I192","v":0},"　角パイプ","100角鋼管","OO40",38.08,null,null,"","","",null,"OO40","１００角バタ　　　４．０Ｍ　【青】",{"v":0,"d":"0 "},{"v":38.08,"d":"38 "},{"v":0,"d":"0 "},{"v":0,"d":"0 "},{"v":0,"d":"0 "},{"$nulls":4},"*","2025-10-05","日","休業日"]
[{"$f":"IF(B190=\"\",\"\",(COUNTIF($B$2:B190,B190)))","v":""},"","チェーン付クランプ（チェーン）","W820　1セット：チェーン1本＋クランプ2個",{"$f":"入力!I193","v":0},"　チェーン","出入口用チェーン","PCC1",0.45,10,null,"","","",null,"PCC1","チェーン付クランプ（チェーン）",{"v":0,"d":"0 "},{"v":0.45,"d":"0 "},{"v":0,"d":"0 "},{"v":10,"d":"10 "},{"$f":"ROUNDDOWN(R190/U190,0)","v":{"v":0,"d":"0 "}},{"$nulls":4},"","2025-10-06","月"]
[{"$f":"IF(B191=\"\",\"\",(COUNTIF($B$2:B191,B191)))","v":""},"","チェーン付クランプ（クランプ）","兼用φ42.7・φ48.6",{"$f":"入力!I194","v":0},"　チェーン","出入口用チェーン","PCC2",0.45,null,null,"","","",null,"PCC2","チェーン付クランプ（クランプ）",{"v":0,"d":"0 "},{"v":0.45,"d":"0 "},{"v":0,"d":"0 "},{"v":0,"d":"0 "},{"$f":"T191*U191","v":{"v":0,"d":"0 "}},{"$nulls":4},"","2025-10-07","火"]
[{"$f":"IF(B192=\"\",\"\",(COUNTIF($B$2:B192,B192)))","v":""},"","ロック付チェーン２Ｍ","外れ止めロック付",{"$f":"入力!I195","v":0},"　チェーン","吊チェーン","PCR20",{"v":1.5,"d":"1.50"},10,null,"","","",null,"PCR20","ロック付チェーン２Ｍ",{"v":0,"d":"0 "},{"v":1.5,"d":"2 "},{"v":0,"d":"0 "},{"v":10,"d":"10 "},{"$f":"ROUNDDOWN(R192/U192,0)","v":{"v":0,"d":"0 "}},{"$nulls":4},"","2025-10-08","水"]
[{"$f":"IF(B193=\"\",\"\",(COUNTIF($B$2:B193,B193)))","v":""},"","ロック付チェーン３Ｍ","外れ止めロック付",{"$f":"入力!I196","v":0},"　チェーン","吊チェーン","PCR30",{"v":2.2,"d":"2.20"},10,null,"","","",null,{"$f":"IF(E193=\"0\",\"\",H193)","v":"PCR30"},{"$f":"IF(E193=\"0\",\"\",C193)","v":"ロック付チェーン３Ｍ"},{"v":0,"d":"0 "},{"v":2.2,"d":"2 "},{"v":0,"d":"0 "},{"v":10,"d":"10 "},{"v":0,"d":"0 "},{"$nulls":4},"","2025-10-09","木"]
[{"$f":"IF(B194=\"\",\"\",(COUNTIF($B$2:B194,B194)))","v":""},"","ロック付チェーン４Ｍ","外れ止めロック付",{"$f":"入力!I197","v":0},"　チェーン","吊チェーン","PCR40",{"v":2.9,"d":"2.90"},5,null,{"$f":"IFERROR(VLOOKUP(K194,$A$2:$E$999,3,FALSE),\"\")","v":""},{"$f":"IFERROR(VLOOKUP(K194,$A$2:$E$99,4,FALSE),\"\")","v":""},{"$f":"IFERROR(VLOOKUP(K194,$A$2:$E$499,5,FALSE),\"\")","v":""},null,"PCR40","ロック付チェーン４Ｍ",{"$f":"IF(E194=\"\",\"\",E194)","v":{"v":0,"d":"0 "}},{"$f":"IF(E194=\"\",0,I194)","v":{"v":2.9,"d":"3 "}},{"v":0,"d":"0 "},{"$f":"IF(E194=\"0\",\"\",J194)","v":{"v":5,"d":"5 "}},{"v":0,"d":"0 "},{"$nulls":4},"","2025-10-10",{"$f":"TEXT(AB194,\"aaa\")","v":"金"}]
[{"$f":"IF(B195=\"\",\"\",(COUNTIF($B$2:B195,B195)))","v":""},{"$f":"IF(E195,\"1\",\"\")","v":""},"ロック付チェーン５Ｍ","外れ止めロック付",{"$f":"入力!I198","v":0},"　チェーン","吊チェーン","PCR50",{"v":3.2,"d":"3.20"},5,null,"","","",null,"PCR50","ロック付チェーン５Ｍ",{"v":0,"d":"0 "},{"v":3.2,"d":"3 "},{"$f":"R195*S195","v":{"v":0,"d":"0 "}},{"v":5,"d":"5 "},{"v":0,"d":"0 "},{"$nulls":4},{"$f":"IF(AD195=\"\",\"\",\"*\")","v":"*"},"2025-10-11","土","休業日"]
[{"$f":"IF(B196=\"\",\"\",(COUNTIF($B$2:B196,B196)))","v":""},"","座キャッチ３７チェーン固定用","掴み：0～100",{"$f":"入力!I199","v":0},"　チェーン","吊チェーン","CK1J",{"v":0.8,"d":"0.80"},20,null,{"$f":"IFERROR(VLOOKUP(K196,$A$2:$E$999,3,FALSE),\"\")","v":""},{"$f":"IFERROR(VLOOKUP(K196,$A$2:$E$99,4,FALSE),\"\")","v":""},{"$f":"IFERROR(VLOOKUP(K196,$A$2:$E$499,5,FALSE),\"\")","v":""},null,{"$f":"IF(E196=\"0\",\"\",H196)","v":"CK1J"},{"$f":"IF(E196=\"0\",\"\",C196)","v":"座キャッチ３７チェーン固定用"},{"$f":"IF(E196=\"\",\"\",E196)","v":{"v":0,"d":"0 "}},{"$f":"IF(E196=\"\",0,I196)","v":{"v":0.8,"d":"1 "}},{"$f":"R196*S196","v":{"v":0,"d":"0 "}},{"$f":"IF(E196=\"0\",\"\",J196)","v":{"v":20,"d":"20 "}},{"$f":"ROUNDDOWN(R196/U196,0)","v":{"v":0,"d":"0 "}},{"$nulls":4},"*",{"$f":"AB195+1","v":"2025-10-12"},"日","休業日"]
[{"$f":"IF(B197=\"\",\"\",(COUNTIF($B$2:B197,B197)))","v":""},"","ロングチェーン金具","掴み：6～100",{"$f":"入力!I200","v":0},"　チェーン","吊チェーン","CK1L",{"v":1.5,"d":"1.50"},10,null,"","","",null,"CK1L","ロングチェーン金具",{"v":0,"d":"0 "},{"v":1.5,"d":"2 "},{"v":0,"d":"0 "},{"v":10,"d":"10 "},{"v":0,"d":"0 "},{"$nulls":4},"*","2025-10-13","月","祝日"]
[{"$f":"IF(B198=\"\",\"\",(COUNTIF($B$2:B198,B198)))","v":""},"","単管バリケード【青】","H770・H220　W560　1セット2台使用",{"$f":"入力!I201","v":0},"　マルチパレット・キャスター・バリケードなど","単管バリケード・OKマット","PB",{"v":4,"d":"4.00"},null,null,"","","",null,"PB","単管バリケード【青】",{"v":0,"d":"0 "},{"v":4,"d":"4 "},{"v":0,"d":"0 "},{"v":0,"d":"0 "},{"$f":"T198*U198","v":{"v":0,"d":"0 "}},{"$nulls":4},"","2025-10-14","火"]
[{"$f":"IF(B199=\"\",\"\",(COUNTIF($B$2:B199,B199)))","v":""},"","ＯＫマット【青】","W450×L2000",{"$f":"入力!I202","v":0},"　マルチパレット・キャスター・バリケードなど","単管バリケード・OKマット","OKM",{"v":6,"d":"6.00"},null,null,"","","",null,"OKM","ＯＫマット【青】",{"v":0,"d":"0 "},{"v":6,"d":"6 "},{"v":0,"d":"0 "},{"v":0,"d":"0 "},{"v":0,"d":"0 "},{"$nulls":4},"","2025-10-15","水"]
[{"$f":"IF(B200=\"\",\"\",(COUNTIF($B$2:B200,B200)))","v":""},"","ホワイトキャスター８吋","調節長：272～472",{"$f":"入力!I203","v":0},"　マルチパレット・キャスター・バリケードなど","キャスター・アウトリガー","AGW8",{"v":7.4,"d":"7.40"},null,null,"","","",null,"AGW8","ホワイトキャスター８吋",{"v":0,"d":"0 "},{"v":7.4,"d":"7 "},{"v":0,"d":"0 "},{"v":0,"d":"0 "},{"v":0,"d":"0 "},{"$nulls":4},"","2025-10-16","木"]
[{"$f":"IF(B201=\"\",\"\",(COUNTIF($B$2:B201,B201)))","v":""},"","SPアウトリガー","W600　H760（625）",{"$f":"入力!I204","v":0},"　マルチパレット・キャスター・バリケードなど","キャスター・アウトリガー","ARSP",{"v":10.2,"d":"10.20"},null,null,"","","",null,"ARSP","SPアウトリガー",{"v":0,"d":"0 "},{"v":10.2,"d":"10 "},{"v":0,"d":"0 "},{"v":0,"d":"0 "},{"v":0,"d":"0 "},{"$nulls":4},"","2025-10-17","金"]
[{"$f":"IF(B202=\"\",\"\",(COUNTIF($B$2:B202,B202)))","v":""},"","ロクリン（アルミ6輪1トン台車）","W755　D1205　H263",{"$f":"入力!I205","v":0},"　マルチパレット・キャスター・バリケードなど","マルチパレット・アルミ台車","NAC6",{"v":29.5,"d":"29.50"},null,null,"","","",null,"NAC6","ロクリン（アルミ6輪1トン台車）",{"v":0,"d":"0 "},{"v":29.5,"d":"30 "},{"v":0,"d":"0 "},{"v":0,"d":"0 "},{"v":0,"d":"0 "},{"$nulls":4},"*","2025-10-18","土","休業日"]
[{"$f":"IF(B203=\"\",\"\",(COUNTIF($B$2:B203,B203)))","v":""},"","コンボキシィ（車輪付）","W1066　D913　H729",{"$f":"入力!I206","v":0},"　マルチパレット・キャスター・バリケードなど","マルチパレット・アルミ台車","MPNC",{"v":98.4,"d":"98.40"},null,null,"","","",null,"MPNC","コンボキシィ（車輪付）",{"v":0,"d":"0 "},{"v":98.4,"d":"98 "},{"v":0,"d":"0 "},{"v":0,"d":"0 "},{"v":0,"d":"0 "},{"$nulls":4},"*","2025-10-19","日","休業日"]
[{"$f":"IF(B204=\"\",\"\",(COUNTIF($B$2:B204,B204)))","v":""},"","マルチパレット","W1129　D953　H690",{"$f":"入力!I207","v":0},"　マルチパレット・キャスター・バリケードなど","マルチパレット・アルミ台車","MPS",{"v":98,"d":"98.00"},null,null,"","","",null,"MPS","マルチパレット",{"v":0,"d":"0 "},{"v":98,"d":"98 "},{"v":0,"d":"0 "},{"v":0,"d":"0 "},{"v":0,"d":"0 "},{"$nulls":4},"","2025-10-20","月"]
[{"$f":"IF(B205=\"\",\"\",(COUNTIF($B$2:B205,B205)))","v":""},"","マルチパレットハーフ","W1072　D915　H400",{"$f":"入力!I208","v":0},"　マルチパレット・キャスター・バリケードなど","マルチパレット・アルミ台車","MPSH",{"v":65,"d":"65.00"},null,null,"","","",null,"MPSH","マルチパレットハーフ",{"v":0,"d":"0 "},{"v":65,"d":"65 "},{"v":0,"d":"0 "},{"v":0,"d":"0 "},{"v":0,"d":"0 "},{"$nulls":4},"","2025-10-21","火"]
[{"$f":"IF(B206=\"\",\"\",(COUNTIF($B$2:B206,B206)))","v":""},"","ＹＴ支柱１８","H1800 φ48.6",{"$f":"入力!I209","v":0},"　YTロックシステム","YT支柱・カラー材","YTP18",{"v":6.3,"d":"6.30"},null,null,"","","",null,"YTP18","ＹＴ支柱１８",{"v":0,"d":"0 "},{"v":6.3,"d":"6 "},{"v":0,"d":"0 "},{"v":0,"d":"0 "},{"v":0,"d":"0 "},{"$nulls":4},"","2025-10-22","水"]
[{"$f":"IF(B207=\"\",\"\",(COUNTIF($B$2:B207,B207)))","v":""},"","ＹＴ支柱０９","H900 φ48.6",{"$f":"入力!I210","v":0},"　YTロックシステム","YT支柱・カラー材","YTP09",{"v":3.4,"d":"3.40"},null,null,"","","",null,"YTP09","ＹＴ支柱０９",{"v":0,"d":"0 "},{"v":3.4,"d":"3 "},{"v":0,"d":"0 "},{"v":0,"d":"0 "},{"v":0,"d":"0 "},{"$nulls":4},"","2025-10-23","木"]
[{"$f":"IF(B208=\"\",\"\",(COUNTIF($B$2:B208,B208)))","v":""},"","ＹＴ支柱０４５","H450 φ48.6",{"$f":"入力!I211","v":0},"　YTロックシステム","YT支柱・カラー材","YTP045",{"v":2.3,"d":"2.30"},null,null,"","","",null,"YTP045","ＹＴ支柱０４５",{"v":0,"d":"0 "},{"v":2.3,"d":"2 "},{"v":0,"d":"0 "},{"v":0,"d":"0 "},{"v":0,"d":"0 "},{"$nulls":4},"","2025-10-24","金"]
[{"$f":"IF(B209=\"\",\"\",(COUNTIF($B$2:B209,B209)))","v":""},"","ＹＴ支柱０２２５","H225 φ48.6",{"$f":"入力!I212","v":0},"　YTロックシステム","YT支柱・カラー材","YTP0225",{"v":1.4,"d":"1.40"},null,null,"","","",null,"YTP0225","ＹＴ支柱０２２５",{"v":0,"d":"0 "},{"v":1.4,"d":"1 "},{"v":0,"d":"0 "},{"v":0,"d":"0 "},{"v":0,"d":"0 "},{"$nulls":4},"*","2025-10-25","土","休業日"]
[{"$f":"IF(B210=\"\",\"\",(COUNTIF($B$2:B210,B210)))","v":""},"","ＹＴヘッド支柱０９","上部ホゾ無　H900",{"$f":"入力!I213","v":0},"　YTロックシステム","YT支柱・カラー材","YTP09H",{"v":2.8,"d":"2.80"},null,null,"","","",null,"YTP09H","ＹＴヘッド支柱０９",{"v":0,"d":"0 "},{"v":2.8,"d":"3 "},{"v":0,"d":"0 "},{"v":0,"d":"0 "},{"v":0,"d":"0 "},{"$nulls":4},"*","2025-10-26","日","休業日"]
[{"$f":"IF(B211=\"\",\"\",(COUNTIF($B$2:B211,B211)))","v":""},"","YTトップカラー５４３","L1829　φ42.7",{"$f":"入力!I214","v":0},"　YTロックシステム","YT支柱・カラー材","YTKR543",{"v":4.6,"d":"4.60"},null,null,"","","",null,"YTKR543","YTトップカラー５４３",{"v":0,"d":"0 "},{"v":4.6,"d":"5 "},{"v":0,"d":"0 "},{"v":0,"d":"0 "},{"v":0,"d":"0 "},{"$nulls":4},"","2025-10-27","月"]
[{"$f":"IF(B212=\"\",\"\",(COUNTIF($B$2:B212,B212)))","v":""},"","YTトップカラー２２５","L1829　φ42.7",{"$f":"入力!I215","v":0},"　YTロックシステム","YT支柱・カラー材","YTKR225",{"v":4.6,"d":"4.60"},null,null,"","","",null,"YTKR225","YTトップカラー２２５",{"v":0,"d":"0 "},{"v":4.6,"d":"5 "},{"v":0,"d":"0 "},{"v":0,"d":"0 "},{"v":0,"d":"0 "},{"$nulls":4},"","2025-10-28","火"]
[{"$f":"IF(B213=\"\",\"\",(COUNTIF($B$2:B213,B213)))","v":""},"","YTカラー材１２０","L1829　φ42.7",{"$f":"入力!I216","v":0},"　YTロックシステム","YT支柱・カラー材","YTKR120",{"v":4.6,"d":"4.60"},null,null,"","","",null,"YTKR120","YTカラー材１２０",{"v":0,"d":"0 "},{"v":4.6,"d":"5 "},{"v":0,"d":"0 "},{"v":0,"d":"0 "},{"v":0,"d":"0 "},{"$nulls":4},"","2025-10-29","水"]
[{"$f":"IF(B214=\"\",\"\",(COUNTIF($B$2:B214,B214)))","v":""},"","ＹＴ水平材１８","L1829　φ42.7",{"$f":"入力!I217","v":0},"　YTロックシステム","YT水平材・YT先行ブレース","YTSC18",{"v":4.6,"d":"4.60"},null,null,"","","",null,"YTSC18","ＹＴ水平材１８",{"v":0,"d":"0 "},{"v":4.6,"d":"5 "},{"v":0,"d":"0 "},{"v":0,"d":"0 "},{"v":0,"d":"0 "},{"$nulls":4},"","2025-10-30","木"]
[{"$f":"IF(B215=\"\",\"\",(COUNTIF($B$2:B215,B215)))","v":""},"","ＹＴ水平材１５","L1524　φ42.7",{"$f":"入力!I218","v":0},"　YTロックシステム","YT水平材・YT先行ブレース","YTSC15",{"v":3.9,"d":"3.90"},null,null,"","","",null,"YTSC15","ＹＴ水平材１５",{"v":0,"d":"0 "},{"v":3.9,"d":"4 "},{"v":0,"d":"0 "},{"v":0,"d":"0 "},{"v":0,"d":"0 "},{"$nulls":4},"","2025-10-31","金"]
[{"$f":"IF(B216=\"\",\"\",(COUNTIF($B$2:B216,B216)))","v":""},"","ＹＴ水平材１２","W・L1219　φ42.7",{"$f":"入力!I219","v":0},"　YTロックシステム","YT水平材・YT先行ブレース","YTSC12",{"v":3.3,"d":"3.30"},null,null,"","","",null,"YTSC12","ＹＴ水平材１２",{"v":0,"d":"0 "},{"v":3.3,"d":"3 "},{"v":0,"d":"0 "},{"v":0,"d":"0 "},{"v":0,"d":"0 "},{"$nulls":4},"*","2025-11-01","土","休業日"]
[{"$f":"IF(B217=\"\",\"\",(COUNTIF($B$2:B217,B217)))","v":""},"","ＹＴ水平材０９","W・L914　φ42.7",{"$f":"入力!I220","v":0},"　YTロックシステム","YT水平材・YT先行ブレース","YTSC09",{"v":2.5,"d":"2.50"},null,null,"","","",null,"YTSC09","ＹＴ水平材０９",{"v":0,"d":"0 "},{"v":2.5,"d":"3 "},{"v":0,"d":"0 "},{"v":0,"d":"0 "},{"v":0,"d":"0 "},{"$nulls":4},"*","2025-11-02","日","休業日"]
[{"$f":"IF(B218=\"\",\"\",(COUNTIF($B$2:B218,B218)))","v":""},"","ＹＴ水平材０６","W・L610　φ42.7",{"$f":"入力!I221","v":0},"　YTロックシステム","YT水平材・YT先行ブレース","YTSC06",{"v":1.7,"d":"1.70"},null,null,"","","",null,"YTSC06","ＹＴ水平材０６",{"v":0,"d":"0 "},{"v":1.7,"d":"2 "},{"v":0,"d":"0 "},{"v":0,"d":"0 "},{"v":0,"d":"0 "},{"$nulls":4},"*","2025-11-03","月","祝日"]
[{"$f":"IF(B219=\"\",\"\",(COUNTIF($B$2:B219,B219)))","v":""},"","ＹＴ水平材０３","L305　φ42.7",{"$f":"入力!I222","v":0},"　YTロックシステム","YT水平材・YT先行ブレース","YTSC03",{"v":1,"d":"1.00"},null,null,"","","",null,"YTSC03","ＹＴ水平材０３",{"v":0,"d":"0 "},{"v":1,"d":"1 "},{"v":0,"d":"0 "},{"v":0,"d":"0 "},{"v":0,"d":"0 "},{"$nulls":4},"","2025-11-04","火"]
[{"$f":"IF(B220=\"\",\"\",(COUNTIF($B$2:B220,B220)))","v":""},"","ＹＴ水平材０１","L150　φ42.7",{"$f":"入力!I223","v":0},"　YTロックシステム","YT水平材・YT先行ブレース","YTSC01",{"v":0.5,"d":"0.50"},null,null,"","","",null,"YTSC01","ＹＴ水平材０１",{"v":0,"d":"0 "},{"v":0.5,"d":"1 "},{"v":0,"d":"0 "},{"v":0,"d":"0 "},{"v":0,"d":"0 "},{"$nulls":4},"","2025-11-05","水"]
[{"$f":"IF(B221=\"\",\"\",(COUNTIF($B$2:B221,B221)))","v":""},"","ＹＴ斜面ブラケット９０９","張出914",{"$f":"入力!I224","v":0},"　YTロックシステム","YTカイダン類・ブラケット","YTBK909",{"v":9.7,"d":"9.70"},null,null,"","","",null,"YTBK909","ＹＴ斜面ブラケット９０９",{"v":0,"d":"0 "},{"v":9.7,"d":"10 "},{"v":0,"d":"0 "},{"v":0,"d":"0 "},{"v":0,"d":"0 "},{"$nulls":4},"","2025-11-06","木"]
[{"$f":"IF(B222=\"\",\"\",(COUNTIF($B$2:B222,B222)))","v":""},"","ＹＴ斜面ブラケット６０９","張出610",{"$f":"入力!I225","v":0},"　YTロックシステム","YTカイダン類・ブラケット","YTBK609",{"v":8.6,"d":"8.60"},null,null,"","","",null,"YTBK609","ＹＴ斜面ブラケット６０９",{"v":0,"d":"0 "},{"v":8.6,"d":"9 "},{"v":0,"d":"0 "},{"v":0,"d":"0 "},{"v":0,"d":"0 "},{"$nulls":4},"","2025-11-07","金"]
[{"$f":"IF(B223=\"\",\"\",(COUNTIF($B$2:B223,B223)))","v":""},"","ＹＴピンブラケット３０４","張出305　ピン付",{"$f":"入力!I226","v":0},"　YTロックシステム","YTカイダン類・ブラケット","YTPK304",{"v":2.8,"d":"2.80"},null,null,"","","",null,"YTPK304","ＹＴピンブラケット３０４",{"v":0,"d":"0 "},{"v":2.8,"d":"3 "},{"v":0,"d":"0 "},{"v":0,"d":"0 "},{"v":0,"d":"0 "},{"$nulls":4},"*","2025-11-08","土","休業日"]
[{"$f":"IF(B224=\"\",\"\",(COUNTIF($B$2:B224,B224)))","v":""},"","ＹＴ先行ブレース１８","L1829　H900",{"$f":"入力!I227","v":0},"　YTロックシステム","YT水平材・YT先行ブレース","YTST18",{"v":6.6,"d":"6.60"},null,null,"","","",null,"YTST18","ＹＴ先行ブレース１８",{"v":0,"d":"0 "},{"v":6.6,"d":"7 "},{"v":0,"d":"0 "},{"v":0,"d":"0 "},{"v":0,"d":"0 "},{"$nulls":4},"*","2025-11-09","日","休業日"]
[{"$f":"IF(B225=\"\",\"\",(COUNTIF($B$2:B225,B225)))","v":""},"","ＹＴ先行ブレース１５","L1524　H900",{"$f":"入力!I228","v":0},"　YTロックシステム","YT水平材・YT先行ブレース","YTST15",{"v":5.8,"d":"5.80"},null,null,"","","",null,"YTST15","ＹＴ先行ブレース１５",{"v":0,"d":"0 "},{"v":5.8,"d":"6 "},{"v":0,"d":"0 "},{"v":0,"d":"0 "},{"v":0,"d":"0 "},{"$nulls":4},"","2025-11-10","月"]
[{"$f":"IF(B226=\"\",\"\",(COUNTIF($B$2:B226,B226)))","v":""},"","ＹＴ先行ブレース１２","L1219　H900",{"$f":"入力!I229","v":0},"　YTロックシステム","YT水平材・YT先行ブレース","YTST12",{"v":5,"d":"5.00"},null,null,"","","",null,"YTST12","ＹＴ先行ブレース１２",{"v":0,"d":"0 "},{"v":5,"d":"5 "},{"v":0,"d":"0 "},{"v":0,"d":"0 "},{"v":0,"d":"0 "},{"$nulls":4},"","2025-11-11","火"]
[{"$f":"IF(B227=\"\",\"\",(COUNTIF($B$2:B227,B227)))","v":""},"","ＹＴ先行ブレース０９","L914　H900",{"$f":"入力!I230","v":0},"　YTロックシステム","YT水平材・YT先行ブレース","YTST09",{"v":4.2,"d":"4.20"},null,null,"","","",null,"YTST09","ＹＴ先行ブレース０９",{"v":0,"d":"0 "},{"v":4.2,"d":"4 "},{"v":0,"d":"0 "},{"v":0,"d":"0 "},{"v":0,"d":"0 "},{"$nulls":4},"","2025-11-12","水"]
[{"$f":"IF(B228=\"\",\"\",(COUNTIF($B$2:B228,B228)))","v":""},"","ＳＰカイダン","6段　W471　L2275",{"$f":"入力!I231","v":0},"　YTロックシステム","YTカイダン類・ブラケット","VKSP",{"v":10.5,"d":"10.50"},null,null,"","","",null,"VKSP","ＳＰカイダン",{"v":0,"d":"0 "},{"v":10.5,"d":"11 "},{"v":0,"d":"0 "},{"v":0,"d":"0 "},{"v":0,"d":"0 "},{"$nulls":4},"","2025-11-13","木"]
[{"$f":"IF(B229=\"\",\"\",(COUNTIF($B$2:B229,B229)))","v":""},"","ＳＰカイダン手摺","二段一体式",{"$f":"入力!I232","v":0},"　YTロックシステム","YTカイダン類・ブラケット","VKTSP",{"v":4.2,"d":"4.20"},null,null,"","","",null,"VKTSP","ＳＰカイダン手摺",{"v":0,"d":"0 "},{"v":4.2,"d":"4 "},{"v":0,"d":"0 "},{"v":0,"d":"0 "},{"v":0,"d":"0 "},{"$nulls":4},"","2025-11-14","金"]
[{"$f":"IF(B230=\"\",\"\",(COUNTIF($B$2:B230,B230)))","v":""},"","ＹＴ吊り金具","4点吊り＝1セット：4個使用",{"$f":"入力!I233","v":0},"　YTロックシステム","YTカイダン類・ブラケット","YTTG",{"v":0.7,"d":"0.70"},null,null,"","","",null,"YTTG","ＹＴ吊り金具",{"v":0,"d":"0 "},{"v":0.7,"d":"1 "},{"v":0,"d":"0 "},{"v":0,"d":"0 "},{"v":0,"d":"0 "},{"$nulls":4},"*","2025-11-15","土","休業日"]
[{"$f":"IF(B231=\"\",\"\",(COUNTIF($B$2:B231,B231)))","v":""},"","ＹＴＳブレース０６０９　【ムラサキ】    ","W610×H900",{"$f":"入力!I234","v":0},"　YTロックシステム","YTSブレース","YTS0609",{"v":2.9,"d":"2.90"},null,null,"","","",null,"YTS0609","ＹＴＳブレース０６０９　【ムラサキ】    ",{"v":0,"d":"0 "},{"v":2.9,"d":"3 "},{"v":0,"d":"0 "},{"v":0,"d":"0 "},{"v":0,"d":"0 "},{"$nulls":4},"*","2025-11-16","日","休業日"]
[{"$f":"IF(B232=\"\",\"\",(COUNTIF($B$2:B232,B232)))","v":""},"","ＹＴＳブレース０９０９　【黒】    ","W610×H1350・W914×H900",{"$f":"入力!I235","v":0},"　YTロックシステム","YTSブレース","YTS0909",{"v":3.5,"d":"3.50"},null,null,"","","",null,"YTS0909","ＹＴＳブレース０９０９　【黒】    ",{"v":0,"d":"0 "},{"v":3.5,"d":"4 "},{"v":0,"d":"0 "},{"v":0,"d":"0 "},{"v":0,"d":"0 "},{"$nulls":4},"","2025-11-17","月"]
[{"$f":"IF(B233=\"\",\"\",(COUNTIF($B$2:B233,B233)))","v":""},"","ＹＴＳブレース０９１８   ","W610×H1800・W914×H1800・W1219×H1350",{"$f":"入力!I236","v":0},"　YTロックシステム","YTSブレース","YTS0918",{"v":4.5,"d":"4.50"},null,null,"","","",null,"YTS0918","ＹＴＳブレース０９１８   ",{"v":0,"d":"0 "},{"v":4.5,"d":"5 "},{"v":0,"d":"0 "},{"v":0,"d":"0 "},{"v":0,"d":"0 "},{"$nulls":4},"","2025-11-18","火"]
[{"$f":"IF(B234=\"\",\"\",(COUNTIF($B$2:B234,B234)))","v":""},"","ＹＴＳブレース１２０９　【青】    ","W914×H1350・W1219×H900",{"$f":"入力!I237","v":0},"　YTロックシステム","YTSブレース","YTS1209",{"v":4.1,"d":"4.10"},null,null,"","","",null,"YTS1209","ＹＴＳブレース１２０９　【青】    ",{"v":0,"d":"0 "},{"v":4.1,"d":"4 "},{"v":0,"d":"0 "},{"v":0,"d":"0 "},{"v":0,"d":"0 "},{"$nulls":4},"","2025-11-19","水"]
[{"$f":"IF(B235=\"\",\"\",(COUNTIF($B$2:B235,B235)))","v":""},"","ＹＴＳブレース１８０９　【黄】    ","W1219×H1800・W1524×H1800・W1829×H900",{"$f":"入力!I238","v":0},"　YTロックシステム","YTSブレース","YTS1809",{"v":5.4,"d":"5.40"},null,null,"","","",null,"YTS1809","ＹＴＳブレース１８０９　【黄】    ",{"v":0,"d":"0 "},{"v":5.4,"d":"5 "},{"v":0,"d":"0 "},{"v":0,"d":"0 "},{"v":0,"d":"0 "},{"$nulls":4},"","2025-11-20","木"]
[{"$f":"IF(B236=\"\",\"\",(COUNTIF($B$2:B236,B236)))","v":""},"","ＹＴＳブレース１８１８　【緑】    ","W1829×H1800",{"$f":"入力!I239","v":0},"　YTロックシステム","YTSブレース","YTS1818",{"v":6.2,"d":"6.20"},null,null,"","","",null,"YTS1818","ＹＴＳブレース１８１８　【緑】    ",{"v":0,"d":"0 "},{"v":6.2,"d":"6 "},{"v":0,"d":"0 "},{"v":0,"d":"0 "},{"v":0,"d":"0 "},{"$nulls":4},"","2025-11-21","金"]
[{"$f":"IF(B237=\"\",\"\",(COUNTIF($B$2:B237,B237)))","v":""},"","ＹＴＤブレース０６０９","W610×H900",{"$f":"入力!I240","v":0},"　YTロックシステム","YTDブレース","YTD0609",{"v":4.6,"d":"4.60"},null,null,"","","",null,"YTD0609","ＹＴＤブレース０６０９",{"v":0,"d":"0 "},{"v":4.6,"d":"5 "},{"v":0,"d":"0 "},{"v":0,"d":"0 "},{"v":0,"d":"0 "},{"$nulls":4},"*","2025-11-22","土","休業日"]
[{"$f":"IF(B238=\"\",\"\",(COUNTIF($B$2:B238,B238)))","v":""},"","ＹＴＤブレース０６１８","W610×H1800・W1524×H900",{"$f":"入力!I241","v":0},"　YTロックシステム","YTDブレース","YTD0618",{"v":6.6,"d":"6.60"},null,null,"","","",null,"YTD0618","ＹＴＤブレース０６１８",{"v":0,"d":"0 "},{"v":6.6,"d":"7 "},{"v":0,"d":"0 "},{"v":0,"d":"0 "},{"v":0,"d":"0 "},{"$nulls":4},"*","2025-11-23","日","休業日"]
[{"$f":"IF(B239=\"\",\"\",(COUNTIF($B$2:B239,B239)))","v":""},"","ＹＴＤブレース０９０９","W914×H900",{"$f":"入力!I242","v":0},"　YTロックシステム","YTDブレース","YTD0909",{"v":5.2,"d":"5.20"},null,null,"","","",null,"YTD0909","ＹＴＤブレース０９０９",{"v":0,"d":"0 "},{"v":5.2,"d":"5 "},{"v":0,"d":"0 "},{"v":0,"d":"0 "},{"v":0,"d":"0 "},{"$nulls":4},"*","2025-11-24","月","祝日"]
[{"$f":"IF(B240=\"\",\"\",(COUNTIF($B$2:B240,B240)))","v":""},"","ＹＴＤブレース０９１８    ","W914×H1800",{"$f":"入力!I243","v":0},"　YTロックシステム","YTDブレース","YTD0918",{"v":6.9,"d":"6.90"},null,null,"","","",null,"YTD0918","ＹＴＤブレース０９１８    ",{"v":0,"d":"0 "},{"v":6.9,"d":"7 "},{"v":0,"d":"0 "},{"v":0,"d":"0 "},{"v":0,"d":"0 "},{"$nulls":4},"","2025-11-25","火"]
[{"$f":"IF(B241=\"\",\"\",(COUNTIF($B$2:B241,B241)))","v":""},"","ＹＴＤブレース１２０９","W1219×H900",{"$f":"入力!I244","v":0},"　YTロックシステム","YTDブレース","YTD1209",{"v":5.9,"d":"5.90"},null,null,"","","",null,"YTD1209","ＹＴＤブレース１２０９",{"v":0,"d":"0 "},{"v":5.9,"d":"6 "},{"v":0,"d":"0 "},{"v":0,"d":"0 "},{"v":0,"d":"0 "},{"$nulls":4},"","2025-11-26","水"]
[{"$f":"IF(B242=\"\",\"\",(COUNTIF($B$2:B242,B242)))","v":""},"","ＹＴＤブレース１２１８","W1219×H1800・W1829×H900",{"$f":"入力!I245","v":0},"　YTロックシステム","YTDブレース","YTD1818",{"v":7.3,"d":"7.30"},null,null,"","","",null,"YTD1818","ＹＴＤブレース１２１８",{"v":0,"d":"0 "},{"v":7.3,"d":"7 "},{"v":0,"d":"0 "},{"v":0,"d":"0 "},{"v":0,"d":"0 "},{"$nulls":4},"","2025-11-27","木"]
[{"$f":"IF(B243=\"\",\"\",(COUNTIF($B$2:B243,B243)))","v":""},"","*マキシムベース　１８型　可搬式作業台","H1355～1755　L1540　W500　",{"$f":"入力!I246","v":0},"*可搬式作業台","立ち馬","XAT0303",{"v":29.5,"d":"29.50"},null,null,"","","",null,"XAT0303","*マキシムベース　１８型　可搬式作業台",{"v":0,"d":"0 "},{"v":29.5,"d":"30 "},{"v":0,"d":"0 "},{"v":0,"d":"0 "},{"v":0,"d":"0 "},{"$nulls":4},"","2025-11-28","金"]
[{"$f":"IF(B244=\"\",\"\",(COUNTIF($B$2:B244,B244)))","v":""},"","*マキシムベース　１５型　可搬式作業台","H1040～1440　L1540　W500　",{"$f":"入力!I247","v":0},"*可搬式作業台","立ち馬","XAT0304",{"v":28.5,"d":"28.50"},null,null,"","","",null,"XAT0304","*マキシムベース　１５型　可搬式作業台",{"v":0,"d":"0 "},{"v":28.5,"d":"29 "},{"v":0,"d":"0 "},{"v":0,"d":"0 "},{"v":0,"d":"0 "},{"$nulls":4},"*","2025-11-29","土","休業日"]
[{"$f":"IF(B245=\"\",\"\",(COUNTIF($B$2:B245,B245)))","v":""},"","*マキシムベース　１０型　可搬式作業台","H725～1125　L1540　W500　",{"$f":"入力!I248","v":0},"*可搬式作業台","立ち馬","XAT0305",22.01,null,null,"","","",null,"XAT0305","*マキシムベース　１０型　可搬式作業台",{"v":0,"d":"0 "},{"v":22.01,"d":"22 "},{"v":0,"d":"0 "},{"v":0,"d":"0 "},{"v":0,"d":"0 "},{"$nulls":4},"*","2025-11-30","日","休業日"]
[{"$f":"IF(B246=\"\",\"\",(COUNTIF($B$2:B246,B246)))","v":""},"","*ラッセルネット　０．５Ｘ６  Ｋ ","水平用１５㍉目合　橙･赤",{"$f":"入力!I249","v":0},"*親綱・ネット・シート類","水平ネット","WKY1101",{"v":2.5,"d":"2.50"},null,null,"","","",null,"WKY1101","*ラッセルネット　０．５Ｘ６  Ｋ ",{"v":0,"d":"0 "},{"v":2.5,"d":"3 "},{"v":0,"d":"0 "},{"v":0,"d":"0 "},{"v":0,"d":"0 "},{"$nulls":4},"","2025-12-01","月"]
[{"$f":"IF(B247=\"\",\"\",(COUNTIF($B$2:B247,B247)))","v":""},"","*ラッセルネット　１Ｘ６  Ｋ   ","水平用１５㍉目合　黒･赤",{"$f":"入力!I250","v":0},"*親綱・ネット・シート類","水平ネット","WKY1102",{"v":3.7,"d":"3.70"},null,null,"","","",null,"WKY1102","*ラッセルネット　１Ｘ６  Ｋ   ",{"v":0,"d":"0 "},{"v":3.7,"d":"4 "},{"v":0,"d":"0 "},{"v":0,"d":"0 "},{"v":0,"d":"0 "},{"$nulls":4},"","2025-12-02","火"]
[{"$f":"IF(B248=\"\",\"\",(COUNTIF($B$2:B248,B248)))","v":""},"","*ラッセルネット　２Ｘ６   Ｋ   ","水平用１５㍉目合　黄･赤",{"$f":"入力!I251","v":0},"*親綱・ネット・シート類","水平ネット","WKY1103",{"v":5.7,"d":"5.70"},null,null,"","","",null,"WKY1103","*ラッセルネット　２Ｘ６   Ｋ   ",{"v":0,"d":"0 "},{"v":5.7,"d":"6 "},{"v":0,"d":"0 "},{"v":0,"d":"0 "},{"v":0,"d":"0 "},{"$nulls":4},"","2025-12-03","水"]
[{"$f":"IF(B249=\"\",\"\",(COUNTIF($B$2:B249,B249)))","v":""},"","*ラッセルネット　３Ｘ６  Ｋ   ","水平用１５㍉目合　緑･赤",{"$f":"入力!I252","v":0},"*親綱・ネット・シート類","水平ネット","WKY1104",{"v":7.5,"d":"7.50"},null,null,"","","",null,"WKY1104","*ラッセルネット　３Ｘ６  Ｋ   ",{"v":0,"d":"0 "},{"v":7.5,"d":"8 "},{"v":0,"d":"0 "},{"v":0,"d":"0 "},{"v":0,"d":"0 "},{"$nulls":4},"","2025-12-04","木"]
[{"$f":"IF(B250=\"\",\"\",(COUNTIF($B$2:B250,B250)))","v":""},"","*ラッセルネット　５Ｘ５   Ｋ   ","水平用１５㍉目合　青･青",{"$f":"入力!I253","v":0},"*親綱・ネット・シート類","水平ネット","WKY1106",{"v":10.5,"d":"10.50"},null,null,"","","",null,"WKY1106","*ラッセルネット　５Ｘ５   Ｋ   ",{"v":0,"d":"0 "},{"v":10.5,"d":"11 "},{"v":0,"d":"0 "},{"v":0,"d":"0 "},{"v":0,"d":"0 "},{"$nulls":4},"","2025-12-05","金"]
[{"$f":"IF(B251=\"\",\"\",(COUNTIF($B$2:B251,B251)))","v":""},"","*ラッセルネット　４Ｘ７  Ｋ   ","水平用１５㍉目合　緑･黒",{"$f":"入力!I254","v":0},"*親綱・ネット・シート類","水平ネット","WKY1105",{"v":11.3,"d":"11.30"},null,null,"","","",null,"WKY1105","*ラッセルネット　４Ｘ７  Ｋ   ",{"v":0,"d":"0 "},{"v":11.3,"d":"11 "},{"v":0,"d":"0 "},{"v":0,"d":"0 "},{"v":0,"d":"0 "},{"$nulls":4},"*","2025-12-06","土","休業日"]
[{"$f":"IF(B252=\"\",\"\",(COUNTIF($B$2:B252,B252)))","v":""},"","*ラッセルネット　６Ｘ６   Ｋ   ","水平用１５㍉目合　赤･赤",{"$f":"入力!I255","v":0},"*親綱・ネット・シート類","水平ネット","WKY1108",{"v":13.8,"d":"13.80"},null,null,"","","",null,"WKY1108","*ラッセルネット　６Ｘ６   Ｋ   ",{"v":0,"d":"0 "},{"v":13.8,"d":"14 "},{"v":0,"d":"0 "},{"v":0,"d":"0 "},{"v":0,"d":"0 "},{"$nulls":4},"*","2025-12-07","日","休業日"]
[{"$f":"IF(B253=\"\",\"\",(COUNTIF($B$2:B253,B253)))","v":""},"","*ラッセルネット　７Ｘ７  Ｋ   ","水平用１５㍉目合　黒･黒",{"$f":"入力!I256","v":0},"*親綱・ネット・シート類","水平ネット","WKY1109",{"v":18.6,"d":"18.60"},null,null,"","","",null,"WKY1109","*ラッセルネット　７Ｘ７  Ｋ   ",{"v":0,"d":"0 "},{"v":18.6,"d":"19 "},{"v":0,"d":"0 "},{"v":0,"d":"0 "},{"v":0,"d":"0 "},{"$nulls":4},"","2025-12-08","月"]
[{"$f":"IF(B254=\"\",\"\",(COUNTIF($B$2:B254,B254)))","v":""},"","*ラッセルネット　５Ｘ１０   Ｋ   ","水平用１５㍉目合　青･黄",{"$f":"入力!I257","v":0},"*親綱・ネット・シート類","水平ネット","WKY1107",{"v":19,"d":"19.00"},null,null,"","","",null,"WKY1107","*ラッセルネット　５Ｘ１０   Ｋ   ",{"v":0,"d":"0 "},{"v":19,"d":"19 "},{"v":0,"d":"0 "},{"v":0,"d":"0 "},{"v":0,"d":"0 "},{"$nulls":4},"","2025-12-09","火"]
[{"$f":"IF(B255=\"\",\"\",(COUNTIF($B$2:B255,B255)))","v":""},"","*ラッセルネット　８Ｘ８   Ｋ   ","水平用１５㍉目合　橙･橙",{"$f":"入力!I258","v":0},"*親綱・ネット・シート類","水平ネット","WKY1111",{"v":24.5,"d":"24.50"},null,null,"","","",null,"WKY1111","*ラッセルネット　８Ｘ８   Ｋ   ",{"v":0,"d":"0 "},{"v":24.5,"d":"25 "},{"v":0,"d":"0 "},{"v":0,"d":"0 "},{"v":0,"d":"0 "},{"$nulls":4},"","2025-12-10","水"]
[{"$f":"IF(B256=\"\",\"\",(COUNTIF($B$2:B256,B256)))","v":""},"","*ラッセルネット　7Ｘ10   Ｋ   ","水平用１５㍉目合　黒･黄",{"$f":"入力!I259","v":0},"*親綱・ネット・シート類","水平ネット","WKY1113",{"v":26.8,"d":"26.80"},null,null,"","","",null,"WKY1113","*ラッセルネット　7Ｘ10   Ｋ   ",{"v":0,"d":"0 "},{"v":26.8,"d":"27 "},{"v":0,"d":"0 "},{"v":0,"d":"0 "},{"v":0,"d":"0 "},{"$nulls":4},"","2025-12-11","木"]
[{"$f":"IF(B257=\"\",\"\",(COUNTIF($B$2:B257,B257)))","v":""},"","*イエローネット防炎　1×6　KY","15㍉目合　注意喚起ネット",{"$f":"入力!I260","v":0},"*親綱・ネット・シート類","垂直ネット","WKY4180",{"v":3.7,"d":"3.70"},null,null,"","","",null,"WKY4180","*イエローネット防炎　1×6　KY",{"v":0,"d":"0 "},{"v":3.7,"d":"4 "},{"v":0,"d":"0 "},{"v":0,"d":"0 "},{"v":0,"d":"0 "},{"$nulls":4},"","2025-12-12","金"]
[{"$f":"IF(B258=\"\",\"\",(COUNTIF($B$2:B258,B258)))","v":""},"","*安全ネット　１Ｘ６   Ｋ   ","水平用１００㍉目合　黒･赤",{"$f":"入力!I261","v":0},"*親綱・ネット・シート類","水平ネット","WKY1206",{"v":3.2,"d":"3.20"},null,null,"","","",null,"WKY1206","*安全ネット　１Ｘ６   Ｋ   ",{"v":0,"d":"0 "},{"v":3.2,"d":"3 "},{"v":0,"d":"0 "},{"v":0,"d":"0 "},{"v":0,"d":"0 "},{"$nulls":4},"*","2025-12-13",{"$f":"TEXT(AB258,\"aaa\")","v":"土"},"休業日"]
[{"$f":"IF(B259=\"\",\"\",(COUNTIF($B$2:B259,B259)))","v":""},{"$f":"IF(E259,\"1\",\"\")","v":""},"*安全ネット　３Ｘ６   Ｋ   ","水平用１００㍉目合　緑赤･白",{"$f":"入力!I262","v":0},"*親綱・ネット・シート類","水平ネット","WKY1201",{"v":7.5,"d":"7.50"},null,null,"","","",null,"WKY1201","*安全ネット　３Ｘ６   Ｋ   ",{"v":0,"d":"0 "},{"v":7.5,"d":"8 "},{"v":0,"d":"0 "},{"v":0,"d":"0 "},{"v":0,"d":"0 "},{"$nulls":4},{"$f":"IF(AD259=\"\",\"\",\"*\")","v":"*"},"2025-12-14","日","休業日"]
[{"$f":"IF(B260=\"\",\"\",(COUNTIF($B$2:B260,B260)))","v":""},"","*安全ネット　５Ｘ５  Ｋ   ","水平用１００㍉目合　青･青",{"$f":"入力!I263","v":0},"*親綱・ネット・シート類","水平ネット","WKY1203",{"v":10.1,"d":"10.10"},null,null,{"$f":"IFERROR(VLOOKUP(K260,$A$2:$E$999,3,FALSE),\"\")","v":""},{"$f":"IFERROR(VLOOKUP(K260,$A$2:$E$99,4,FALSE),\"\")","v":""},{"$f":"IFERROR(VLOOKUP(K260,$A$2:$E$499,5,FALSE),\"\")","v":""},null,{"$f":"IF(E260=\"0\",\"\",H260)","v":"WKY1203"},{"$f":"IF(E260=\"0\",\"\",C260)","v":"*安全ネット　５Ｘ５  Ｋ   "},{"$f":"IF(E260=\"\",\"\",E260)","v":{"v":0,"d":"0 "}},{"$f":"IF(E260=\"\",0,I260)","v":{"v":10.1,"d":"10 "}},{"$f":"R260*S260","v":{"v":0,"d":"0 "}},{"$f":"IF(E260=\"0\",\"\",J260)","v":{"v":0,"d":"0 "}},{"v":0,"d":"0 "},{"$nulls":4},"",{"$f":"AB259+1","v":"2025-12-15"},"月"]
[{"$f":"IF(B261=\"\",\"\",(COUNTIF($B$2:B261,B261)))","v":""},"","*安全ネット　６Ｘ６   Ｋ   ","水平用１００㍉目合　青･黄",{"$f":"入力!I264","v":0},"*親綱・ネット・シート類","水平ネット","WKY1204",{"v":13.6,"d":"13.60"},null,null,"","","",null,"WKY1204","*安全ネット　６Ｘ６   Ｋ   ",{"v":0,"d":"0 "},{"v":13.6,"d":"14 "},{"v":0,"d":"0 "},{"v":0,"d":"0 "},{"v":0,"d":"0 "},{"$nulls":4},"","2025-12-16","火"]
[{"$f":"IF(B262=\"\",\"\",(COUNTIF($B$2:B262,B262)))","v":""},"","*安全ネット　５Ｘ１０   Ｋ   ","水平用１００㍉目合　赤･赤",{"$f":"入力!I265","v":0},"*親綱・ネット・シート類","水平ネット","WKY1202",{"v":18.2,"d":"18.20"},null,null,"","","",null,"WKY1202","*安全ネット　５Ｘ１０   Ｋ   ",{"v":0,"d":"0 "},{"v":18.2,"d":"18 "},{"v":0,"d":"0 "},{"v":0,"d":"0 "},{"$f":"T262*U262","v":{"v":0,"d":"0 "}},{"$nulls":4},"","2025-12-17","水"]
[{"$f":"IF(B263=\"\",\"\",(COUNTIF($B$2:B263,B263)))","v":""},"","*安全ネット　８Ｘ８   Ｋ   ","水平用１００㍉目合　橙･橙",{"$f":"入力!I266","v":0},"*親綱・ネット・シート類","水平ネット","WKY1205",{"v":22.1,"d":"22.10"},null,null,"","","",null,"WKY1205","*安全ネット　８Ｘ８   Ｋ   ",{"v":0,"d":"0 "},{"v":22.1,"d":"22 "},{"v":0,"d":"0 "},{"v":0,"d":"0 "},{"v":0,"d":"0 "},{"$nulls":4},"","2025-12-18","木"]
[{"$f":"IF(B264=\"\",\"\",(COUNTIF($B$2:B264,B264)))","v":""},"","*安全ネット１０Ｘ１０   Ｋ   ","水平用１００㍉目合　黄･黄",{"$f":"入力!I267","v":0},"*親綱・ネット・シート類","水平ネット","WKY1207",{"v":38,"d":"38.00"},null,null,"","","",null,"WKY1207","*安全ネット１０Ｘ１０   Ｋ   ",{"v":0,"d":"0 "},{"v":38,"d":"38 "},{"v":0,"d":"0 "},{"v":0,"d":"0 "},{"v":0,"d":"0 "},{"$nulls":4},"","2025-12-19","金"]
[{"$f":"IF(B265=\"\",\"\",(COUNTIF($B$2:B265,B265)))","v":""},"","*キョーワネット　１×１０   KY  ","垂直用１５㍉目合　黄",{"$f":"入力!I268","v":0},"*親綱・ネット・シート類","垂直ネット","WKY1401",{"v":3,"d":"3.00"},null,null,"","","",null,"WKY1401","*キョーワネット　１×１０   KY  ",{"v":0,"d":"0 "},{"v":3,"d":"3 "},{"v":0,"d":"0 "},{"v":0,"d":"0 "},{"v":0,"d":"0 "},{"$nulls":4},"*","2025-12-20","土","休業日"]
[{"$f":"IF(B266=\"\",\"\",(COUNTIF($B$2:B266,B266)))","v":""},"","*キョーワネット　３．６×１２    KY   ","垂直用１５㍉目合　緑",{"$f":"入力!I269","v":0},"*親綱・ネット・シート類","垂直ネット","WKY1402",{"v":8.8,"d":"8.80"},null,null,"","","",null,"WKY1402","*キョーワネット　３．６×１２    KY   ",{"v":0,"d":"0 "},{"v":8.8,"d":"9 "},{"v":0,"d":"0 "},{"v":0,"d":"0 "},{"v":0,"d":"0 "},{"$nulls":4},"*","2025-12-21","日","休業日"]
[{"$f":"IF(B267=\"\",\"\",(COUNTIF($B$2:B267,B267)))","v":""},"","*キョーワネット　　６×１２     KY   ","垂直用１５㍉目合　白",{"$f":"入力!I270","v":0},"*親綱・ネット・シート類","垂直ネット","WKY1404",{"v":14,"d":"14.00"},null,null,"","","",null,"WKY1404","*キョーワネット　　６×１２     KY   ",{"v":0,"d":"0 "},{"v":14,"d":"14 "},{"v":0,"d":"0 "},{"v":0,"d":"0 "},{"v":0,"d":"0 "},{"$nulls":4},"","2025-12-22","月"]
[{"$f":"IF(B268=\"\",\"\",(COUNTIF($B$2:B268,B268)))","v":""},"","*ブルーネット　　１Ｘ１０  　Ｋ   ","垂直用１５㍉目合　黄",{"$f":"入力!I271","v":0},"*親綱・ネット・シート類","垂直ネット","WKY1323",{"v":3,"d":"3.00"},null,null,"","","",null,"WKY1323","*ブルーネット　　１Ｘ１０  　Ｋ   ",{"v":0,"d":"0 "},{"v":3,"d":"3 "},{"v":0,"d":"0 "},{"v":0,"d":"0 "},{"v":0,"d":"0 "},{"$nulls":4},"","2025-12-23","火"]
[{"$f":"IF(B269=\"\",\"\",(COUNTIF($B$2:B269,B269)))","v":""},"","*ブルーネット　　６Ｘ６  　Ｋ   ","垂直用１５㍉目合　赤",{"$f":"入力!I272","v":0},"*親綱・ネット・シート類","垂直ネット","WKY1326",{"v":7,"d":"7.00"},null,null,"","","",null,"WKY1326","*ブルーネット　　６Ｘ６  　Ｋ   ",{"v":0,"d":"0 "},{"v":7,"d":"7 "},{"v":0,"d":"0 "},{"v":0,"d":"0 "},{"v":0,"d":"0 "},{"$nulls":4},"","2025-12-24","水"]
[{"$f":"IF(B270=\"\",\"\",(COUNTIF($B$2:B270,B270)))","v":""},"","*ブルーネット３．６Ｘ１２  　Ｋ   ","垂直用１５㍉目合　白",{"$f":"入力!I273","v":0},"*親綱・ネット・シート類","垂直ネット","WKY1327",{"v":8.8,"d":"8.80"},null,null,"","","",null,"WKY1327","*ブルーネット３．６Ｘ１２  　Ｋ   ",{"v":0,"d":"0 "},{"v":8.8,"d":"9 "},{"v":0,"d":"0 "},{"v":0,"d":"0 "},{"v":0,"d":"0 "},{"$nulls":4},"","2025-12-25","木"]
[{"$f":"IF(B271=\"\",\"\",(COUNTIF($B$2:B271,B271)))","v":""},"","*ブルーネット　　６Ｘ１２  　Ｋ   ","垂直用１５㍉目合　白",{"$f":"入力!I274","v":0},"*親綱・ネット・シート類","垂直ネット","WKY1324",{"v":14,"d":"14.00"},null,null,"","","",null,"WKY1324","*ブルーネット　　６Ｘ１２  　Ｋ   ",{"v":0,"d":"0 "},{"v":14,"d":"14 "},{"v":0,"d":"0 "},{"v":0,"d":"0 "},{"v":0,"d":"0 "},{"$nulls":4},"","2025-12-26","金"]
[{"$f":"IF(B272=\"\",\"\",(COUNTIF($B$2:B272,B272)))","v":""},"","*シルバーネット　１Ｘ１０  　Ｋ   ","垂直用１５㍉目合　黄",{"$f":"入力!I275","v":0},"*親綱・ネット・シート類","垂直ネット","WKY1341",{"v":3,"d":"3.00"},null,null,"","","",null,"WKY1341","*シルバーネット　１Ｘ１０  　Ｋ   ",{"v":0,"d":"0 "},{"v":3,"d":"3 "},{"v":0,"d":"0 "},{"v":0,"d":"0 "},{"v":0,"d":"0 "},{"$nulls":4},"*","2025-12-27","土","休業日"]
[{"$f":"IF(B273=\"\",\"\",(COUNTIF($B$2:B273,B273)))","v":""},"","*シルバーネット　４Ｘ７  　ＫY  ","垂直用１５㍉目合　黒",{"$f":"入力!I276","v":0},"*親綱・ネット・シート類","垂直ネット","WKY0125",{"v":5.6,"d":"5.60"},null,null,"","","",null,"WKY0125","*シルバーネット　４Ｘ７  　ＫY  ",{"v":0,"d":"0 "},{"v":5.6,"d":"6 "},{"v":0,"d":"0 "},{"v":0,"d":"0 "},{"v":0,"d":"0 "},{"$nulls":4},"*","2025-12-28","日","休業日"]
[{"$f":"IF(B274=\"\",\"\",(COUNTIF($B$2:B274,B274)))","v":""},"","*シルバーネット　７Ｘ７  　Ｋ   ","垂直用１５㍉目合　黒",{"$f":"入力!I277","v":0},"*親綱・ネット・シート類","垂直ネット","WKY1344",{"v":9.8,"d":"9.80"},null,null,"","","",null,"WKY1344","*シルバーネット　７Ｘ７  　Ｋ   ",{"v":0,"d":"0 "},{"v":9.8,"d":"10 "},{"v":0,"d":"0 "},{"v":0,"d":"0 "},{"v":0,"d":"0 "},{"$nulls":4},"*","2025-12-29","月","冬季休業日"]
[{"$f":"IF(B275=\"\",\"\",(COUNTIF($B$2:B275,B275)))","v":""},"","*シルバーネット　４Ｘ１４  　Ｋ   ","垂直用１５㍉目合　緑",{"$f":"入力!I278","v":0},"*親綱・ネット・シート類","垂直ネット","WKY1342",{"v":11.2,"d":"11.20"},null,null,"","","",null,"WKY1342","*シルバーネット　４Ｘ１４  　Ｋ   ",{"v":0,"d":"0 "},{"v":11.2,"d":"11 "},{"v":0,"d":"0 "},{"v":0,"d":"0 "},{"v":0,"d":"0 "},{"$nulls":4},"*","2025-12-30","火","冬季休業日"]
[{"$f":"IF(B276=\"\",\"\",(COUNTIF($B$2:B276,B276)))","v":""},"","*シルバーネット　７Ｘ１４  　Ｋ   ","垂直用１５㍉目合　橙",{"$f":"入力!I279","v":0},"*親綱・ネット・シート類","垂直ネット","WKY1343",{"v":19.6,"d":"19.60"},null,null,"","","",null,"WKY1343","*シルバーネット　７Ｘ１４  　Ｋ   ",{"v":0,"d":"0 "},{"v":19.6,"d":"20 "},{"v":0,"d":"0 "},{"v":0,"d":"0 "},{"v":0,"d":"0 "},{"$nulls":4},"*","2025-12-31","水","冬季休業日"]
[{"$f":"IF(B277=\"\",\"\",(COUNTIF($B$2:B277,B277)))","v":""},"","*ネットブラケット　　　Ｋ   ","小幅ネット用　340～500",{"$f":"入力!I280","v":0},"*親綱・ネット・シート類","水平ネット","WKY0020",{"v":2.6,"d":"2.60"},null,null,"","","",null,"WKY0020","*ネットブラケット　　　Ｋ   ",{"v":0,"d":"0 "},{"v":2.6,"d":"3 "},{"v":0,"d":"0 "},{"v":0,"d":"0 "},{"v":0,"d":"0 "},{"$nulls":4},"*","2026-01-01","木","冬季休業日"]
[{"$f":"IF(B278=\"\",\"\",(COUNTIF($B$2:B278,B278)))","v":""},"","*親綱ロ－プ　６M　　Ｋ   ","１６φ　方フック付　白",{"$f":"入力!I281","v":0},"*親綱・ネット・シート類","親綱・安全ブロック","WKY0026",{"v":1.5,"d":"1.50"},null,null,"","","",null,"WKY0026","*親綱ロ－プ　６M　　Ｋ   ",{"v":0,"d":"0 "},{"v":1.5,"d":"2 "},{"v":0,"d":"0 "},{"v":0,"d":"0 "},{"v":0,"d":"0 "},{"$nulls":4},"*","2026-01-02","金","冬季休業日"]
[{"$f":"IF(B279=\"\",\"\",(COUNTIF($B$2:B279,B279)))","v":""},"","*親綱ロ－プ　８Ｍ　　Ｋ   ","１６φ　方フック付　緑",{"$f":"入力!I282","v":0},"*親綱・ネット・シート類","親綱・安全ブロック","WKY0027",{"v":1.8,"d":"1.80"},null,null,"","","",null,"WKY0027","*親綱ロ－プ　８Ｍ　　Ｋ   ",{"v":0,"d":"0 "},{"v":1.8,"d":"2 "},{"v":0,"d":"0 "},{"v":0,"d":"0 "},{"v":0,"d":"0 "},{"$nulls":4},"*","2026-01-03","土","冬季休業日"]
[{"$f":"IF(B280=\"\",\"\",(COUNTIF($B$2:B280,B280)))","v":""},"","*親綱ロ－プ　１０Ｍ　　Ｋ   ","１６φ　方フック付　黄",{"$f":"入力!I283","v":0},"*親綱・ネット・シート類","親綱・安全ブロック","WKY0021",{"v":2.2,"d":"2.20"},null,null,"","","",null,"WKY0021","*親綱ロ－プ　１０Ｍ　　Ｋ   ",{"v":0,"d":"0 "},{"v":2.2,"d":"2 "},{"v":0,"d":"0 "},{"v":0,"d":"0 "},{"v":0,"d":"0 "},{"$nulls":4},"*","2026-01-04","日","冬季休業日"]
[{"$f":"IF(B281=\"\",\"\",(COUNTIF($B$2:B281,B281)))","v":""},"","*親綱ロ－プ　１２Ｍ　　Ｋ   ","１６φ　方フック付　橙",{"$f":"入力!I284","v":0},"*親綱・ネット・シート類","親綱・安全ブロック","WKY0022",{"v":2.4,"d":"2.40"},null,null,"","","",null,"WKY0022","*親綱ロ－プ　１２Ｍ　　Ｋ   ",{"v":0,"d":"0 "},{"v":2.4,"d":"2 "},{"v":0,"d":"0 "},{"v":0,"d":"0 "},{"v":0,"d":"0 "},{"$nulls":4},"*","2026-01-05","月","冬季休業日"]
[{"$f":"IF(B282=\"\",\"\",(COUNTIF($B$2:B282,B282)))","v":""},"","*親綱ロ－プ　１５Ｍ　　Ｋ   ","１６φ　方フック付　青",{"$f":"入力!I285","v":0},"*親綱・ネット・シート類","親綱・安全ブロック","WKY0023",{"v":2.9,"d":"2.90"},null,null,"","","",null,"WKY0023","*親綱ロ－プ　１５Ｍ　　Ｋ   ",{"v":0,"d":"0 "},{"v":2.9,"d":"3 "},{"v":0,"d":"0 "},{"v":0,"d":"0 "},{"v":0,"d":"0 "},{"$nulls":4},"","2026-01-06","火"]
[{"$f":"IF(B283=\"\",\"\",(COUNTIF($B$2:B283,B283)))","v":""},"","*親綱ロ－プ　２０Ｍ　　Ｋ   ","１６φ　方フック付　赤",{"$f":"入力!I286","v":0},"*親綱・ネット・シート類","親綱・安全ブロック","WKY0024",{"v":3.7,"d":"3.70"},null,null,"","","",null,"WKY0024","*親綱ロ－プ　２０Ｍ　　Ｋ   ",{"v":0,"d":"0 "},{"v":3.7,"d":"4 "},{"v":0,"d":"0 "},{"v":0,"d":"0 "},{"v":0,"d":"0 "},{"$nulls":4},"","2026-01-07","水"]
[{"$f":"IF(B284=\"\",\"\",(COUNTIF($B$2:B284,B284)))","v":""},"","*親綱ロ－プ　３０Ｍ　　Ｋ   ","１６φ　方フック付　黒",{"$f":"入力!I287","v":0},"*親綱・ネット・シート類","親綱・安全ブロック","WKY0025",{"v":5.4,"d":"5.40"},null,null,"","","",null,"WKY0025","*親綱ロ－プ　３０Ｍ　　Ｋ   ",{"v":0,"d":"0 "},{"v":5.4,"d":"5 "},{"v":0,"d":"0 "},{"v":0,"d":"0 "},{"v":0,"d":"0 "},{"$nulls":4},"","2026-01-08","木"]
[{"$f":"IF(B285=\"\",\"\",(COUNTIF($B$2:B285,B285)))","v":""},"","*キョーワロック　　Ｋ   ","親綱緊張器",{"$f":"入力!I288","v":0},"*親綱・ネット・シート類","親綱・安全ブロック","WKY0019",{"v":1.3,"d":"1.30"},null,null,"","","",null,"WKY0019","*キョーワロック　　Ｋ   ",{"v":0,"d":"0 "},{"v":1.3,"d":"1 "},{"v":0,"d":"0 "},{"v":0,"d":"0 "},{"v":0,"d":"0 "},{"$nulls":4},"","2026-01-09","金"]
[{"$f":"IF(B286=\"\",\"\",(COUNTIF($B$2:B286,B286)))","v":""},"","*キョーワピースクランプ　KY","鉄骨H柱用 親綱・安全ブロック設置金具",{"$f":"入力!I289","v":0},"*親綱・ネット・シート類","親綱・安全ブロック","WKY0135",0.85,null,null,"","","",null,"WKY0135","*キョーワピースクランプ　KY",{"v":0,"d":"0 "},{"v":0.85,"d":"1 "},{"v":0,"d":"0 "},{"v":0,"d":"0 "},{"v":0,"d":"0 "},{"$nulls":4},"*","2026-01-10","土","休業日"]
[{"$f":"IF(B287=\"\",\"\",(COUNTIF($B$2:B287,B287)))","v":""},"","*親綱支持用ベルト　３Ｍ　KY","D環付　ベルト巾50　有効長さ3000",{"$f":"入力!I290","v":0},"*親綱・ネット・シート類","親綱・安全ブロック","WKY0050",{"v":3,"d":"3.00"},null,null,"","","",null,"WKY0050","*親綱支持用ベルト　３Ｍ　KY",{"v":0,"d":"0 "},{"v":3,"d":"3 "},{"v":0,"d":"0 "},{"v":0,"d":"0 "},{"v":0,"d":"0 "},{"$nulls":4},"*","2026-01-11","日","休業日"]
[{"$f":"IF(B288=\"\",\"\",(COUNTIF($B$2:B288,B288)))","v":""},"","*ライトネスシルバー　１．８×５．１    KY   ","軽量メッシュシート",{"$f":"入力!I291","v":0},"*親綱・ネット・シート類","シート","WKY0034",{"v":3.2,"d":"3.20"},null,null,"","","",null,"WKY0034","*ライトネスシルバー　１．８×５．１    KY   ",{"v":0,"d":"0 "},{"v":3.2,"d":"3 "},{"v":0,"d":"0 "},{"v":0,"d":"0 "},{"v":0,"d":"0 "},{"$nulls":4},"*","2026-01-12","月","祝日"]
[{"$f":"IF(B289=\"\",\"\",(COUNTIF($B$2:B289,B289)))","v":""},"","*ライトネスシルバー　１．５×５．１    KY   ","軽量メッシュシート",{"$f":"入力!I292","v":0},"*親綱・ネット・シート類","シート","WKY0035",{"v":2.7,"d":"2.70"},null,null,"","","",null,"WKY0035","*ライトネスシルバー　１．５×５．１    KY   ",{"v":0,"d":"0 "},{"v":2.7,"d":"3 "},{"v":0,"d":"0 "},{"v":0,"d":"0 "},{"v":0,"d":"0 "},{"$nulls":4},"","2026-01-13","火"]
[{"$f":"IF(B290=\"\",\"\",(COUNTIF($B$2:B290,B290)))","v":""},"","*ライトネスシルバー　１．２×５．１    KY   ","軽量メッシュシート",{"$f":"入力!I293","v":0},"*親綱・ネット・シート類","シート","WKY0036",2.25,null,null,"","","",null,"WKY0036","*ライトネスシルバー　１．２×５．１    KY   ",{"v":0,"d":"0 "},{"v":2.25,"d":"2 "},{"v":0,"d":"0 "},{"v":0,"d":"0 "},{"v":0,"d":"0 "},{"$nulls":4},"","2026-01-14","水"]
[{"$f":"IF(B291=\"\",\"\",(COUNTIF($B$2:B291,B291)))","v":""},"","*ライトネスシルバー　０．９×５．１    KY   ","軽量メッシュシート",{"$f":"入力!I294","v":0},"*親綱・ネット・シート類","シート","WKY0037",1.75,null,null,"","","",null,"WKY0037","*ライトネスシルバー　０．９×５．１    KY   ",{"v":0,"d":"0 "},{"v":1.75,"d":"2 "},{"v":0,"d":"0 "},{"v":0,"d":"0 "},{"v":0,"d":"0 "},{"$nulls":4},"","2026-01-15","木"]
[{"$f":"IF(B292=\"\",\"\",(COUNTIF($B$2:B292,B292)))","v":""},"","*ライトネスシルバー　０．６×５．１    KY   ","軽量メッシュシート",{"$f":"入力!I295","v":0},"*親綱・ネット・シート類","シート","WKY0038",1.25,null,null,"","","",null,"WKY0038","*ライトネスシルバー　０．６×５．１    KY   ",{"v":0,"d":"0 "},{"v":1.25,"d":"1 "},{"v":0,"d":"0 "},{"v":0,"d":"0 "},{"v":0,"d":"0 "},{"$nulls":4},"","2026-01-16","金"]
[{"$f":"IF(B293=\"\",\"\",(COUNTIF($B$2:B293,B293)))","v":""},"","*防炎養生シート　１．８×５．１    KY   ","Ⅱ類",{"$f":"入力!I296","v":0},"*親綱・ネット・シート類","シート","WKY2305",{"v":3.8,"d":"3.80"},null,null,"","","",null,"WKY2305","*防炎養生シート　１．８×５．１    KY   ",{"v":0,"d":"0 "},{"v":3.8,"d":"4 "},{"v":0,"d":"0 "},{"v":0,"d":"0 "},{"v":0,"d":"0 "},{"$nulls":4},"*","2026-01-17","土","休業日"]
[{"$f":"IF(B294=\"\",\"\",(COUNTIF($B$2:B294,B294)))","v":""},"","*防炎養生シート　１．５×５．１    KY   ","Ⅱ類",{"$f":"入力!I297","v":0},"*親綱・ネット・シート類","シート","WKY2304",{"v":3,"d":"3.00"},null,null,"","","",null,"WKY2304","*防炎養生シート　１．５×５．１    KY   ",{"v":0,"d":"0 "},{"v":3,"d":"3 "},{"v":0,"d":"0 "},{"v":0,"d":"0 "},{"v":0,"d":"0 "},{"$nulls":4},"*","2026-01-18","日","休業日"]
[{"$f":"IF(B295=\"\",\"\",(COUNTIF($B$2:B295,B295)))","v":""},"","*防炎養生シート　１．２×５．１    KY   ","Ⅱ類",{"$f":"入力!I298","v":0},"*親綱・ネット・シート類","シート","WKY2303",{"v":2.4,"d":"2.40"},null,null,"","","",null,"WKY2303","*防炎養生シート　１．２×５．１    KY   ",{"v":0,"d":"0 "},{"v":2.4,"d":"2 "},{"v":0,"d":"0 "},{"v":0,"d":"0 "},{"v":0,"d":"0 "},{"$nulls":4},"","2026-01-19","月"]
[{"$f":"IF(B296=\"\",\"\",(COUNTIF($B$2:B296,B296)))","v":""},"","*防炎養生シート　０．９×５．１    KY   ","Ⅱ類",{"$f":"入力!I299","v":0},"*親綱・ネット・シート類","シート","WKY2302",{"v":1.9,"d":"1.90"},null,null,"","","",null,"WKY2302","*防炎養生シート　０．９×５．１    KY   ",{"v":0,"d":"0 "},{"v":1.9,"d":"2 "},{"v":0,"d":"0 "},{"v":0,"d":"0 "},{"v":0,"d":"0 "},{"$nulls":4},"","2026-01-20","火"]
[{"$f":"IF(B297=\"\",\"\",(COUNTIF($B$2:B297,B297)))","v":""},"","*防炎養生シート　０．６×５．１    KY   ","Ⅱ類",{"$f":"入力!I300","v":0},"*親綱・ネット・シート類","シート","WKY2301",{"v":1.4,"d":"1.40"},null,null,"","","",null,"WKY2301","*防炎養生シート　０．６×５．１    KY   ",{"v":0,"d":"0 "},{"v":1.4,"d":"1 "},{"v":0,"d":"0 "},{"v":0,"d":"0 "},{"v":0,"d":"0 "},{"$nulls":4},"","2026-01-21","水"]
[{"$f":"IF(B298=\"\",\"\",(COUNTIF($B$2:B298,B298)))","v":""},"","*軽量防音シート　１．８×３．４　Ｋ   ",null,{"$f":"入力!I301","v":0},"*親綱・ネット・シート類","シート","WKY2433",{"v":5.7,"d":"5.70"},null,null,"","","",null,"WKY2433","*軽量防音シート　１．８×３．４　Ｋ   ",{"v":0,"d":"0 "},{"v":5.7,"d":"6 "},{"v":0,"d":"0 "},{"v":0,"d":"0 "},{"v":0,"d":"0 "},{"$nulls":4},"","2026-01-22","木"]
[{"$f":"IF(B299=\"\",\"\",(COUNTIF($B$2:B299,B299)))","v":""},"","*軽量防音シート　１．５×３．４　Ｋ   ",null,{"$f":"入力!I302","v":0},"*親綱・ネット・シート類","シート","WKY2434",{"v":4.9,"d":"4.90"},null,null,"","","",null,"WKY2434","*軽量防音シート　１．５×３．４　Ｋ   ",{"v":0,"d":"0 "},{"v":4.9,"d":"5 "},{"v":0,"d":"0 "},{"v":0,"d":"0 "},{"v":0,"d":"0 "},{"$nulls":4},"","2026-01-23","金"]
[{"$f":"IF(B300=\"\",\"\",(COUNTIF($B$2:B300,B300)))","v":""},"","*軽量防音シート　１．２×３．４　Ｋ   ",null,{"$f":"入力!I303","v":0},"*親綱・ネット・シート類","シート","WKY2432",{"v":4,"d":"4.00"},null,null,"","","",null,"WKY2432","*軽量防音シート　１．２×３．４　Ｋ   ",{"v":0,"d":"0 "},{"v":4,"d":"4 "},{"v":0,"d":"0 "},{"v":0,"d":"0 "},{"v":0,"d":"0 "},{"$nulls":4},"*","2026-01-24","土","休業日"]
[{"$f":"IF(B301=\"\",\"\",(COUNTIF($B$2:B301,B301)))","v":""},"","*軽量防音シート　０．９×３．４　Ｋ   ",null,{"$f":"入力!I304","v":0},"*親綱・ネット・シート類","シート","WKY2431",{"v":3.1,"d":"3.10"},null,null,"","","",null,"WKY2431","*軽量防音シート　０．９×３．４　Ｋ   ",{"v":0,"d":"0 "},{"v":3.1,"d":"3 "},{"v":0,"d":"0 "},{"v":0,"d":"0 "},{"v":0,"d":"0 "},{"$nulls":4},"*","2026-01-25","日","休業日"]
[{"$f":"IF(B302=\"\",\"\",(COUNTIF($B$2:B302,B302)))","v":""},"","*軽量防音シート　０．６×３．４　Ｋ   ",null,{"$f":"入力!I305","v":0},"*親綱・ネット・シート類","シート","WKY2435",{"v":2.5,"d":"2.50"},null,null,"","","",null,"WKY2435","*軽量防音シート　０．６×３．４　Ｋ   ",{"v":0,"d":"0 "},{"v":2.5,"d":"3 "},{"v":0,"d":"0 "},{"v":0,"d":"0 "},{"v":0,"d":"0 "},{"$nulls":4},"","2026-01-26","月"]
[{"$f":"IF(B303=\"\",\"\",(COUNTIF($B$2:B303,B303)))","v":""},"","*安全ブロック(ベルトタイプ)６Ｍ　   ","※引寄せロープ　別途必要",{"$f":"入力!I306","v":0},"*親綱・ネット・シート類","親綱・安全ブロック","WKY0057",2.18,null,null,"","","",null,"WKY0057","*安全ブロック(ベルトタイプ)６Ｍ　   ",{"v":0,"d":"0 "},{"v":2.18,"d":"2 "},{"v":0,"d":"0 "},{"v":0,"d":"0 "},{"v":0,"d":"0 "},{"$nulls":4},"","2026-01-27","火"]
[{"$f":"IF(B304=\"\",\"\",(COUNTIF($B$2:B304,B304)))","v":""},"","*安全ブロック用引寄せロープ　６Ｍ","安全ブロック(ベルトタイプ)6M用",{"$f":"入力!I307","v":0},"*親綱・ネット・シート類","親綱・安全ブロック","WKY0049",{"$nulls":3},"","","",null,"WKY0049","*安全ブロック用引寄せロープ　６Ｍ",{"v":0,"d":"0 "},{"v":0,"d":"0 "},{"v":0,"d":"0 "},{"v":0,"d":"0 "},{"v":0,"d":"0 "},{"$nulls":4},"","2026-01-28","水"]
[{"$f":"IF(B305=\"\",\"\",(COUNTIF($B$2:B305,B305)))","v":""},"","*安全ブロック　１２Ｍ　Ｋ   ","（引寄せﾛｰﾌﾟ込)",{"$f":"入力!I308","v":0},"*親綱・ネット・シート類","親綱・安全ブロック","WKY0031",{"v":6,"d":"6.00"},null,null,"","","",null,"WKY0031","*安全ブロック　１２Ｍ　Ｋ   ",{"v":0,"d":"0 "},{"v":6,"d":"6 "},{"v":0,"d":"0 "},{"v":0,"d":"0 "},{"v":0,"d":"0 "},{"$nulls":4},"","2026-01-29","木"]
[{"$f":"IF(B306=\"\",\"\",(COUNTIF($B$2:B306,B306)))","v":""},"","*安全ブロック　１５Ｍ　Ｋ   ","（引寄せﾛｰﾌﾟ込)",{"$f":"入力!I309","v":0},"*親綱・ネット・シート類","親綱・安全ブロック","WKY0032",{"v":7.5,"d":"7.50"},null,null,"","","",null,"WKY0032","*安全ブロック　１５Ｍ　Ｋ   ",{"v":0,"d":"0 "},{"v":7.5,"d":"8 "},{"v":0,"d":"0 "},{"v":0,"d":"0 "},{"v":0,"d":"0 "},{"$nulls":4},"","2026-01-30","金"]
[{"$f":"IF(B307=\"\",\"\",(COUNTIF($B$2:B307,B307)))","v":""},"","*安全ブロック　２０Ｍ　Ｋ   ","（引寄せﾛｰﾌﾟ込)",{"$f":"入力!I310","v":0},"*親綱・ネット・シート類","親綱・安全ブロック","WKY0033",{"v":11,"d":"11.00"},null,null,"","","",null,"WKY0033","*安全ブロック　２０Ｍ　Ｋ   ",{"v":0,"d":"0 "},{"v":11,"d":"11 "},{"v":0,"d":"0 "},{"v":0,"d":"0 "},{"v":0,"d":"0 "},{"$nulls":4},"*","2026-01-31","土","休業日"]
[{"$f":"IF(B308=\"\",\"\",(COUNTIF($B$2:B308,B308)))","v":""},"","*親綱支柱　直交・平行兼用  KY","鋼製　斜形",{"$f":"入力!I311","v":0},"*親綱・ネット・シート類","親綱・安全ブロック","WKY0028",{"v":8.9,"d":"8.90"},null,null,"","","",null,"WKY0028","*親綱支柱　直交・平行兼用  KY",{"v":0,"d":"0 "},{"v":8.9,"d":"9 "},{"v":0,"d":"0 "},{"v":0,"d":"0 "},{"v":0,"d":"0 "},{"$nulls":4},"*","2026-02-01","日","休業日"]
[{"$f":"IF(B309=\"\",\"\",(COUNTIF($B$2:B309,B309)))","v":""},"","*吊りボックスパレット    KY   ","w1450　D1100　H1150",{"$f":"入力!I312","v":0},"*親綱・ネット・シート類","ボックスパレット","WKY0170",{"v":138,"d":"138.00"},null,null,"","","",null,"WKY0170","*吊りボックスパレット    KY   ",{"v":0,"d":"0 "},{"v":138,"d":"138 "},{"v":0,"d":"0 "},{"v":0,"d":"0 "},{"v":0,"d":"0 "},{"$nulls":4},"","2026-02-02","月"]
[{"$f":"IF(B310=\"\",\"\",(COUNTIF($B$2:B310,B310)))","v":""},"","*ロリップ　　Ｋ   ","垂直用　",{"$f":"入力!I313","v":0},"*親綱・ネット・シート類","親綱・安全ブロック","WKY0030",{"v":1,"d":"1.00"},null,null,"","","",null,"WKY0030","*ロリップ　　Ｋ   ",{"v":0,"d":"0 "},{"v":1,"d":"1 "},{"v":0,"d":"0 "},{"v":0,"d":"0 "},{"v":0,"d":"0 "},{"$nulls":4},"","2026-02-03","火"]
[{"$f":"IF(B311=\"\",\"\",(COUNTIF($B$2:B311,B311)))","v":""},"","*キョーワクランプ（ネット用クランプ）KY","ネット用",{"$f":"入力!I314","v":0},"*親綱・ネット・シート類","水平ネット","WKY0111",0.63,null,null,"","","",null,"WKY0111","*キョーワクランプ（ネット用クランプ）KY",{"v":0,"d":"0 "},{"v":0.63,"d":"1 "},{"v":0,"d":"0 "},{"v":0,"d":"0 "},{"v":0,"d":"0 "},{"$nulls":4},"","2026-02-04","水"]
[{"$f":"IF(B312=\"\",\"\",(COUNTIF($B$2:B312,B312)))","v":""},"","*キョーワハンガー K（メッシュ用ハンガー）","シート用クランプ",{"$f":"入力!I315","v":0},"*親綱・ネット・シート類","シート","WKY0018",{"v":0.4,"d":"0.40"},null,null,"","","",null,"WKY0018","*キョーワハンガー K（メッシュ用ハンガー）",{"v":0,"d":"0 "},{"v":0.4,"d":"0 "},{"v":0,"d":"0 "},{"v":0,"d":"0 "},{"v":0,"d":"0 "},{"$nulls":4},"","2026-02-05","木"]
[{"$f":"IF(B313=\"\",\"\",(COUNTIF($B$2:B313,B313)))","v":""},"","*結束ひも   KY （参考：1本／平米）","50㎝　100本単位販売品",{"$f":"入力!I316","v":0},"*親綱・ネット・シート類","水平ネット","WKY0102",0.01,null,null,"","","",null,"WKY0102","*結束ひも   KY （参考：1本／平米）",{"v":0,"d":"0 "},{"v":0.01,"d":"0 "},{"v":0,"d":"0 "},{"v":0,"d":"0 "},{"v":0,"d":"0 "},{"$nulls":4},"","2026-02-06","金"]
[{"$f":"IF(B314=\"\",\"\",(COUNTIF($B$2:B314,B314)))","v":""},"","*ＰＰロープ   KY （参考：25本／1枚）","62㎝　100本単位販売品",{"$f":"入力!I317","v":0},"*親綱・ネット・シート類","シート","WKY0101",0.01,null,null,"","","",null,"WKY0101","*ＰＰロープ   KY （参考：25本／1枚）",{"v":0,"d":"0 "},{"v":0.01,"d":"0 "},{"v":0,"d":"0 "},{"v":0,"d":"0 "},{"v":0,"d":"0 "},{"$nulls":4},"*","2026-02-07","土","休業日"]
[{"$f":"IF(B315=\"\",\"\",(COUNTIF($B$2:B315,B315)))","v":""},"","*プラワンゲート　UI　単管足場用伸縮開口扉","H600～1000　W600",{"$f":"入力!I318","v":0},"*単管足場用開口扉","単管足場用開口扉","WUI0010",{"v":7,"d":"7.00"},null,null,"","","",null,"WUI0010","*プラワンゲート　UI　単管足場用伸縮開口扉",{"v":0,"d":"0 "},{"v":7,"d":"7 "},{"v":0,"d":"0 "},{"v":0,"d":"0 "},{"v":0,"d":"0 "},{"$nulls":4},"*","2026-02-08","日","休業日"]
[{"$f":"IF(B316=\"\",\"\",(COUNTIF($B$2:B316,B316)))","v":""},"","*アルウォーク　丸バタ(48.6φ単管)用","W650　H1040　 垂直～1割勾配",{"$f":"入力!I319","v":0},"*キャットウォーク","自在式足場ブラケット","WHN0001",{"v":5.3,"d":"5.30"},null,null,"","","",null,"WHN0001","*アルウォーク　丸バタ(48.6φ単管)用",{"v":0,"d":"0 "},{"v":5.3,"d":"5 "},{"v":0,"d":"0 "},{"v":0,"d":"0 "},{"v":0,"d":"0 "},{"$nulls":4},"","2026-02-09","月"]
[{"$f":"IF(B317=\"\",\"\",(COUNTIF($B$2:B317,B317)))","v":""},"","*アルウォーク　角バタ(60角バタ)用","W650　H1040　 垂直～1割勾配",{"$f":"入力!I320","v":0},"*キャットウォーク","自在式足場ブラケット","WHN0002",{"v":5.4,"d":"5.40"},null,null,"","","",null,"WHN0002","*アルウォーク　角バタ(60角バタ)用",{"v":0,"d":"0 "},{"v":5.4,"d":"5 "},{"v":0,"d":"0 "},{"v":0,"d":"0 "},{"v":0,"d":"0 "},{"$nulls":4},"","2026-02-10","火"]
[{"$f":"IF(B318=\"\",\"\",(COUNTIF($B$2:B318,B318)))","v":""},"","*アルウォーク　フック無　※アンカー別途必要","W650　H1040　 垂直～1割勾配",{"$f":"入力!I321","v":0},"*キャットウォーク","自在式足場ブラケット","WHN0003",{"v":4.3,"d":"4.30"},null,null,"","","",null,"WHN0003","*アルウォーク　フック無　※アンカー別途必要",{"v":0,"d":"0 "},{"v":4.3,"d":"4 "},{"v":0,"d":"0 "},{"v":0,"d":"0 "},{"v":0,"d":"0 "},{"$nulls":4},"*","2026-02-11","水","祝日"]
[{"$f":"IF(B319=\"\",\"\",(COUNTIF($B$2:B319,B319)))","v":""},"","*ラバーベース　大　□140用　販売品","ジャッキベース用 （50枚入）",{"$f":"入力!I322","v":0},"*単管キャップ・クランプカバーなど","販売品","WAO0002",0.09,null,null,"","","",null,"WAO0002","*ラバーベース　大　□140用　販売品",{"v":0,"d":"0 "},{"v":0.09,"d":"0 "},{"v":0,"d":"0 "},{"v":0,"d":"0 "},{"v":0,"d":"0 "},{"$nulls":4},"","2026-02-12","木"]
[{"$f":"IF(B320=\"\",\"\",(COUNTIF($B$2:B320,B320)))","v":""},"","*ラバーベース　小　□120用　販売品","固定ベース用（50枚入）",{"$f":"入力!I323","v":0},"*単管キャップ・クランプカバーなど","販売品","WAO0005",0.07,null,null,"","","",null,"WAO0005","*ラバーベース　小　□120用　販売品",{"v":0,"d":"0 "},{"v":0.07,"d":"0 "},{"v":0,"d":"0 "},{"v":0,"d":"0 "},{"v":0,"d":"0 "},{"$nulls":4},"","2026-02-13","金"]
[{"$f":"IF(B321=\"\",\"\",(COUNTIF($B$2:B321,B321)))","v":""},"","*単管ゴムキャップ（黒）AO　販売品","φ48.6用（100個入）",{"$f":"入力!I324","v":0},"*単管キャップ・クランプカバーなど","販売品","WAO0012",0.15,null,null,"","","",null,"WAO0012","*単管ゴムキャップ（黒）AO　販売品",{"v":0,"d":"0 "},{"v":0.15,"d":"0 "},{"v":0,"d":"0 "},{"v":0,"d":"0 "},{"v":0,"d":"0 "},{"$nulls":4},"*","2026-02-14","土","休業日"]
[{"$f":"IF(B322=\"\",\"\",(COUNTIF($B$2:B322,B322)))","v":""},"","*単管パイプ用エコキャッピカ　ＡＯ　販売品","φ48.6単管、鉄筋D19～D25兼用（200個入）",{"$f":"入力!I325","v":0},"*単管キャップ・クランプカバーなど","販売品","WAO0015",0.17,null,null,"","","",null,"WAO0015","*単管パイプ用エコキャッピカ　ＡＯ　販売品",{"v":0,"d":"0 "},{"v":0.17,"d":"0 "},{"v":0,"d":"0 "},{"v":0,"d":"0 "},{"v":0,"d":"0 "},{"$nulls":4},"*","2026-02-15",{"$f":"TEXT(AB322,\"aaa\")","v":"日"},"休業日"]
[{"$f":"IF(B323=\"\",\"\",(COUNTIF($B$2:B323,B323)))","v":""},{"$f":"IF(E323,\"1\",\"\")","v":""},"*クランプ用ソフトカバー　ＡＯ　販売品","黄（100個入）",{"$f":"入力!I326","v":0},"*単管キャップ・クランプカバーなど","販売品","WAO0016",0.04,null,null,"","","",null,"WAO0016","*クランプ用ソフトカバー　ＡＯ　販売品",{"v":0,"d":"0 "},{"v":0.04,"d":"0 "},{"v":0,"d":"0 "},{"v":0,"d":"0 "},{"v":0,"d":"0 "},{"$nulls":4},{"$f":"IF(AD323=\"\",\"\",\"*\")","v":""},"2026-02-16","月"]
[{"$f":"IF(B324=\"\",\"\",(COUNTIF($B$2:B324,B324)))","v":""},"","*単管パイプ用　ハイキャップF型　販売品","黄・青・緑（200個入）",{"$f":"入力!I327","v":0},"*単管キャップ・クランプカバーなど","販売品","XAT0019",{"v":0.112,"d":"0.11"},null,null,{"$f":"IFERROR(VLOOKUP(K324,$A$2:$E$999,3,FALSE),\"\")","v":""},{"$f":"IFERROR(VLOOKUP(K324,$A$2:$E$99,4,FALSE),\"\")","v":""},{"$f":"IFERROR(VLOOKUP(K324,$A$2:$E$499,5,FALSE),\"\")","v":""},null,{"$f":"IF(E324=\"0\",\"\",H324)","v":"XAT0019"},{"$f":"IF(E324=\"0\",\"\",C324)","v":"*単管パイプ用　ハイキャップF型　販売品"},{"$f":"IF(E324=\"\",\"\",E324)","v":{"v":0,"d":"0 "}},{"$f":"IF(E324=\"\",0,I324)","v":{"v":0.112,"d":"0 "}},{"$f":"R324*S324","v":{"v":0,"d":"0 "}},{"$f":"IF(E324=\"0\",\"\",J324)","v":{"v":0,"d":"0 "}},{"v":0,"d":"0 "},{"$nulls":4},"",{"$f":"AB323+1","v":"2026-02-17"},"火"]
[{"$f":"IF(B325=\"\",\"\",(COUNTIF($B$2:B325,B325)))","v":""},"","*ダブルロックパイプ専用　TT-CAP　OD　販売品","φ48.6用（100個入）",{"$f":"入力!I328","v":0},"*単管キャップ・クランプカバーなど","販売品","XAT6530",{"v":0.2,"d":"0.20"},null,null,"","","",null,"XAT6530","*ダブルロックパイプ専用　TT-CAP　OD　販売品",{"v":0,"d":"0 "},{"v":0.2,"d":"0 "},{"v":0,"d":"0 "},{"v":0,"d":"0 "},{"v":0,"d":"0 "},{"$nulls":4},"","2026-02-18","水"]
[{"$f":"IF(B326=\"\",\"\",(COUNTIF($B$2:B326,B326)))","v":""},"","*単管バリケード　プラスチック","Ｗ635　Ｈ820",{"$f":"入力!I329","v":0},"*単管用プラガード","単管用プラガード","WET0021",{"v":2.1,"d":"2.10"},null,null,"","","",null,"WET0021","*単管バリケード　プラスチック",{"v":0,"d":"0 "},{"v":2.1,"d":"2 "},{"v":0,"d":"0 "},{"v":0,"d":"0 "},{"v":0,"d":"0 "},{"$nulls":4},"","2026-02-19","木"]
[{"$f":"IF(B327=\"\",\"\",(COUNTIF($B$2:B327,B327)))","v":""},"","*単管おもし",null,{"$f":"入力!I330","v":0},"*単管用プラガード","単管用プラガード","WET0023",{"v":8,"d":"8.00"},null,null,"","","",null,"WET0023","*単管おもし",{"v":0,"d":"0 "},{"v":8,"d":"8 "},{"v":0,"d":"0 "},{"v":0,"d":"0 "},{"v":0,"d":"0 "},{"$nulls":4},"","2026-02-20","金"]
[{"$f":"IF(B328=\"\",\"\",(COUNTIF($B$2:B328,B328)))","v":""},"","*ＰＰロープ   KY （参考：1本／平米）","62㎝　100本単位販売品",{"$f":"入力!I331","v":0},"*親綱・ネット・シート類","垂直ネット","WKY0101",0.01,null,null,"","","",null,"WKY0101","*ＰＰロープ   KY （参考：1本／平米）",{"v":0,"d":"0 "},{"v":0.01,"d":"0 "},{"v":0,"d":"0 "},{"v":0,"d":"0 "},{"v":0,"d":"0 "},{"$nulls":4},"*","2026-02-21","土","休業日"]
[{"$f":"IF(B329=\"\",\"\",(COUNTIF($B$2:B329,B329)))","v":""},"",null,null,{"$f":"入力!I332","v":0},{"$nulls":6},"","","",null,0,{"v":0,"d":"0 "},{"v":0,"d":"0 "},{"v":0,"d":"0 "},{"v":0,"d":"0 "},{"v":0,"d":"0 "},{"$f":"T329*U329","v":{"v":0,"d":"0 "}},{"$nulls":4},"*","2026-02-22","日","休業日"]
[{"$f":"IF(B330=\"\",\"\",(COUNTIF($B$2:B330,B330)))","v":""},"",null,null,{"$f":"入力!I333","v":0},{"$nulls":6},"","","",null,0,{"v":0,"d":"0 "},{"v":0,"d":"0 "},{"v":0,"d":"0 "},{"v":0,"d":"0 "},{"v":0,"d":"0 "},{"v":0,"d":"0 "},{"$nulls":4},"*","2026-02-23","月","祝日"]
[{"$f":"IF(B331=\"\",\"\",(COUNTIF($B$2:B331,B331)))","v":""},"",null,null,{"$f":"入力!I334","v":0},{"$nulls":6},"","","",null,0,{"v":0,"d":"0 "},{"v":0,"d":"0 "},{"v":0,"d":"0 "},{"v":0,"d":"0 "},{"v":0,"d":"0 "},{"v":0,"d":"0 "},{"$nulls":4},"","2026-02-24","火"]
[{"$f":"IF(B332=\"\",\"\",(COUNTIF($B$2:B332,B332)))","v":""},"",null,null,{"$f":"入力!I335","v":0},{"$nulls":6},"","","",null,0,{"v":0,"d":"0 "},{"v":0,"d":"0 "},{"v":0,"d":"0 "},{"v":0,"d":"0 "},{"v":0,"d":"0 "},{"v":0,"d":"0 "},{"$nulls":4},"","2026-02-25","水"]
[{"$f":"IF(B333=\"\",\"\",(COUNTIF($B$2:B333,B333)))","v":""},"",null,null,{"$f":"入力!I336","v":0},{"$nulls":6},"","","",null,0,{"v":0,"d":"0 "},{"v":0,"d":"0 "},{"v":0,"d":"0 "},{"v":0,"d":"0 "},{"v":0,"d":"0 "},{"v":0,"d":"0 "},{"$nulls":4},"","2026-02-26","木"]
[{"$f":"IF(B334=\"\",\"\",(COUNTIF($B$2:B334,B334)))","v":""},"",null,null,{"$f":"入力!I337","v":0},{"$nulls":6},{"$f":"IFERROR(VLOOKUP(K334,$A$2:$E$999,3,FALSE),\"\")","v":""},{"$f":"IFERROR(VLOOKUP(K334,$A$2:$E$99,4,FALSE),\"\")","v":""},{"$f":"IFERROR(VLOOKUP(K334,$A$2:$E$499,5,FALSE),\"\")","v":""},null,{"$f":"IF(E334=\"0\",\"\",H334)","v":0},{"$f":"IF(E334=\"0\",\"\",C334)","v":{"v":0,"d":"0 "}},{"$f":"IF(E334=\"\",\"\",E334)","v":{"v":0,"d":"0 "}},{"$f":"IF(E334=\"\",0,I334)","v":{"v":0,"d":"0 "}},{"$f":"R334*S334","v":{"v":0,"d":"0 "}},{"$f":"IF(E334=\"0\",\"\",J334)","v":{"v":0,"d":"0 "}},{"$f":"T334*U334","v":{"v":0,"d":"0 "}},{"$nulls":4},"","2026-02-27","金"]
[{"$f":"IF(B335=\"\",\"\",(COUNTIF($B$2:B335,B335)))","v":""},"",null,null,{"$f":"入力!I338","v":0},{"$nulls":6},{"$f":"IFERROR(VLOOKUP(K335,$A$2:$E$999,3,FALSE),\"\")","v":""},{"$f":"IFERROR(VLOOKUP(K335,$A$2:$E$99,4,FALSE),\"\")","v":""},{"$f":"IFERROR(VLOOKUP(K335,$A$2:$E$499,5,FALSE),\"\")","v":""},null,{"$f":"IF(E335=\"0\",\"\",H335)","v":0},{"$f":"IF(E335=\"0\",\"\",C335)","v":{"v":0,"d":"0 "}},{"$f":"IF(E335=\"\",\"\",E335)","v":{"v":0,"d":"0 "}},{"$f":"IF(E335=\"\",0,I335)","v":{"v":0,"d":"0 "}},{"$f":"R335*S335","v":{"v":0,"d":"0 "}},{"$f":"IF(E335=\"0\",\"\",J335)","v":{"v":0,"d":"0 "}},{"$f":"T335*U335","v":{"v":0,"d":"0 "}},{"$nulls":4},"*","2026-02-28","土","休業日"]
[{"$nulls":19},{"v":0,"d":"0 "},{"$f":"IF(E336=\"0\",\"\",J336)","v":{"v":0,"d":"0 "}},{"v":0,"d":"0 "},{"$nulls":4},"*","2026-03-01","日","休業日"]
[{"$nulls":19},{"v":0,"d":"0 "},{"v":0,"d":"0 "},{"v":0,"d":"0 "},{"$nulls":4},"","2026-03-02","月"]
[{"$nulls":19},{"v":0,"d":"0 "},{"v":0,"d":"0 "},{"v":0,"d":"0 "},{"$nulls":4},"","2026-03-03","火"]
[{"$nulls":19},{"v":0,"d":"0 "},{"v":0,"d":"0 "},{"v":0,"d":"0 "},{"$nulls":4},"","2026-03-04","水"]
[{"$nulls":19},{"v":0,"d":"0 "},{"v":0,"d":"0 "},{"v":0,"d":"0 "},{"$nulls":4},"","2026-03-05","木"]
[{"$nulls":19},{"v":0,"d":"0 "},{"v":0,"d":"0 "},{"v":0,"d":"0 "},{"$nulls":4},"","2026-03-06","金"]
[{"$nulls":19},{"v":0,"d":"0 "},{"v":0,"d":"0 "},{"v":0,"d":"0 "},{"$nulls":4},"*","2026-03-07","土","休業日"]
[{"$nulls":19},{"v":0,"d":"0 "},{"v":0,"d":"0 "},{"v":0,"d":"0 "},{"$nulls":4},"*","2026-03-08","日","休業日"]
[{"$nulls":19},{"v":0,"d":"0 "},{"v":0,"d":"0 "},{"v":0,"d":"0 "},{"$nulls":4},"","2026-03-09","月"]
[{"$nulls":19},{"v":0,"d":"0 "},{"v":0,"d":"0 "},{"v":0,"d":"0 "},{"$nulls":4},"","2026-03-10","火"]
[{"$nulls":19},{"v":0,"d":"0 "},{"v":0,"d":"0 "},{"v":0,"d":"0 "},{"$nulls":4},"","2026-03-11","水"]
[{"$nulls":19},{"v":0,"d":"0 "},{"v":0,"d":"0 "},{"v":0,"d":"0 "},{"$nulls":4},"","2026-03-12","木"]
[{"$nulls":19},{"v":0,"d":"0 "},{"v":0,"d":"0 "},{"v":0,"d":"0 "},{"$nulls":4},"","2026-03-13","金"]
[{"$nulls":19},{"v":0,"d":"0 "},{"v":0,"d":"0 "},{"v":0,"d":"0 "},{"$nulls":4},"*","2026-03-14","土","休業日"]
[{"$nulls":19},{"v":0,"d":"0 "},{"v":0,"d":"0 "},{"v":0,"d":"0 "},{"$nulls":4},"*","2026-03-15","日","休業日"]
[{"$nulls":19},{"v":0,"d":"0 "},{"v":0,"d":"0 "},{"v":0,"d":"0 "},{"$nulls":4},"","2026-03-16","月"]
[{"$nulls":19},{"v":0,"d":"0 "},{"v":0,"d":"0 "},{"v":0,"d":"0 "},{"$nulls":4},"","2026-03-17","火"]
[{"$nulls":19},{"v":0,"d":"0 "},{"v":0,"d":"0 "},{"v":0,"d":"0 "},{"$nulls":4},"","2026-03-18","水"]
[{"$nulls":19},{"v":0,"d":"0 "},{"v":0,"d":"0 "},{"v":0,"d":"0 "},{"$nulls":4},"","2026-03-19","木"]
[{"$nulls":19},{"v":0,"d":"0 "},{"v":0,"d":"0 "},{"v":0,"d":"0 "},{"$nulls":4},"*","2026-03-20","金","祝日"]
[{"$nulls":19},{"v":0,"d":"0 "},{"v":0,"d":"0 "},{"v":0,"d":"0 "},{"$nulls":4},"*","2026-03-21","土","休業日"]
[{"$nulls":19},{"v":0,"d":"0 "},{"v":0,"d":"0 "},{"v":0,"d":"0 "},{"$nulls":4},"*","2026-03-22","日","休業日"]
[{"$nulls":19},{"v":0,"d":"0 "},{"v":0,"d":"0 "},{"v":0,"d":"0 "},{"$nulls":4},"","2026-03-23","月"]
[{"$nulls":19},{"v":0,"d":"0 "},{"v":0,"d":"0 "},{"v":0,"d":"0 "},{"$nulls":4},"","2026-03-24","火"]
[{"$nulls":19},{"v":0,"d":"0 "},{"v":0,"d":"0 "},{"v":0,"d":"0 "},{"$nulls":4},"","2026-03-25","水"]
[{"$nulls":19},{"v":0,"d":"0 "},{"v":0,"d":"0 "},{"v":0,"d":"0 "},{"$nulls":4},"","2026-03-26","木"]
[{"$nulls":19},{"v":0,"d":"0 "},{"v":0,"d":"0 "},{"v":0,"d":"0 "},{"$nulls":4},"","2026-03-27","金"]
[{"$nulls":19},{"v":0,"d":"0 "},{"v":0,"d":"0 "},{"v":0,"d":"0 "},{"$nulls":4},"*","2026-03-28","土","休業日"]
[{"$nulls":19},{"v":0,"d":"0 "},{"v":0,"d":"0 "},{"v":0,"d":"0 "},{"$nulls":4},"*","2026-03-29","日","休業日"]
[{"$nulls":19},{"v":0,"d":"0 "},{"v":0,"d":"0 "},{"v":0,"d":"0 "},{"$nulls":4},"","2026-03-30","月"]
[{"$nulls":19},{"v":0,"d":"0 "},{"v":0,"d":"0 "},{"v":0,"d":"0 "},{"$nulls":4},"","2026-03-31","火"]
[{"$nulls":19},{"v":0,"d":"0 "},{"v":0,"d":"0 "},{"v":0,"d":"0 "}]
[{"$nulls":19},{"v":0,"d":"0 "},{"v":0,"d":"0 "},{"v":0,"d":"0 "}]
[{"$nulls":19},{"v":0,"d":"0 "},{"v":0,"d":"0 "},{"v":0,"d":"0 "}]
[{"$nulls":19},{"v":0,"d":"0 "},{"v":0,"d":"0 "},{"v":0,"d":"0 "}]
[{"$nulls":19},{"v":0,"d":"0 "},{"v":0,"d":"0 "},{"v":0,"d":"0 "}]
[{"$nulls":19},{"v":0,"d":"0 "},{"v":0,"d":"0 "},{"v":0,"d":"0 "}]
[{"$nulls":19},{"v":0,"d":"0 "},{"v":0,"d":"0 "},{"v":0,"d":"0 "}]
[{"$nulls":19},{"v":0,"d":"0 "},{"v":0,"d":"0 "},{"v":0,"d":"0 "}]
[{"$nulls":19},{"v":0,"d":"0 "},{"v":0,"d":"0 "},{"v":0,"d":"0 "}]
[{"$nulls":19},{"v":0,"d":"0 "},{"v":0,"d":"0 "},{"v":0,"d":"0 "}]
[{"$nulls":19},{"v":0,"d":"0 "},{"v":0,"d":"0 "},{"$f":"T377*U377","v":{"v":0,"d":"0 "}}]
[{"$nulls":19},{"v":0,"d":"0 "},{"v":0,"d":"0 "},{"v":0,"d":"0 "}]
[{"$nulls":19},{"v":0,"d":"0 "},{"v":0,"d":"0 "},{"v":0,"d":"0 "}]
[{"$nulls":19},{"v":0,"d":"0 "},{"v":0,"d":"0 "},{"v":0,"d":"0 "}]
[{"$nulls":19},{"v":0,"d":"0 "},{"v":0,"d":"0 "},{"v":0,"d":"0 "}]
[{"$nulls":19},{"v":0,"d":"0 "},{"v":0,"d":"0 "},{"v":0,"d":"0 "}]
[{"$nulls":19},{"v":0,"d":"0 "},{"v":0,"d":"0 "},{"v":0,"d":"0 "}]
[{"$nulls":19},{"v":0,"d":"0 "},{"v":0,"d":"0 "},{"v":0,"d":"0 "}]
[{"$nulls":19},{"v":0,"d":"0 "},{"v":0,"d":"0 "},{"v":0,"d":"0 "}]
[{"$nulls":19},{"v":0,"d":"0 "},{"v":0,"d":"0 "},{"v":0,"d":"0 "}]
[{"$nulls":19},{"$f":"R387*S387","v":{"v":0,"d":"0 "}},{"$f":"IF(E387=\"0\",\"\",J387)","v":{"v":0,"d":"0 "}},{"v":0,"d":"0 "}]
[{"$nulls":19},{"v":0,"d":"0 "},{"v":0,"d":"0 "},{"v":0,"d":"0 "}]
[{"$nulls":19},{"v":0,"d":"0 "},{"v":0,"d":"0 "},{"v":0,"d":"0 "}]
[{"$nulls":19},{"v":0,"d":"0 "},{"v":0,"d":"0 "},{"v":0,"d":"0 "}]
[{"$nulls":19},{"v":0,"d":"0 "},{"v":0,"d":"0 "},{"v":0,"d":"0 "}]
[{"$nulls":19},{"v":0,"d":"0 "},{"v":0,"d":"0 "},{"v":0,"d":"0 "}]
[{"$nulls":19},{"v":0,"d":"0 "},{"v":0,"d":"0 "},{"v":0,"d":"0 "}]
[{"$nulls":19},{"v":0,"d":"0 "},{"v":0,"d":"0 "},{"v":0,"d":"0 "}]
[{"$nulls":19},{"v":0,"d":"0 "},{"v":0,"d":"0 "},{"v":0,"d":"0 "}]
[{"$nulls":19},{"v":0,"d":"0 "},{"v":0,"d":"0 "},{"v":0,"d":"0 "}]
[{"$nulls":19},{"v":0,"d":"0 "},{"v":0,"d":"0 "},{"$f":"T397*U397","v":{"v":0,"d":"0 "}}]