{"text_format":"3","workbook":"xlsx","n_sheets":3,"sheets":["入力","発注シート（送付用）","休業日"],"not_rendered":{"images":1,"defined_names":5},"read":"whole","date_system":"1900"}

{"sheet":"入力","index":0,"n_rows":330,"n_cols":19,"rows_kept":330,"merged":[[0,0,0,4],[0,6,0,8],[1,0,1,4],[1,6,1,7],[2,0,2,4],[2,6,2,8]]}
["①の『品目』を選択、②の『分類』を選択、③右側の注文数欄（黄色部）に入力して、",{"$nulls":5},{"$f":"IF(休業日!A314=0,\"\",\"*印の資材は取寄せ品（再リース）にて、納期等は別途でご連絡させて頂きます。\")","v":"*印の資材は取寄せ品（再リース）にて、納期等は別途でご連絡させて頂きます。"}]
["別シート『発注シート(送付用)』に現場名等の必要事項を追記して、ご注文をお願いします。",{"$nulls":5},"資材重量",null,{"$f":"休業日!T1","v":{"v":0,"d":"0.0㌧"}}]
["新たな資材の入力をする場合は　　　　をクリックして選択を解除してください。",{"$nulls":5},"記載が無い資材につきましてはお手数ですが別途お問い合わせをお願いします。",{"$nulls":8},"配 達 希 望","増ｔユニック(積載9ｔ)"]
[{"$nulls":6},"機材名","サイズ等","注文数",null,"①『品目』を選択","②『分類』を選択後　　③右の注文数を入力","コード","重量","土のう袋","自 社 便 引 取","増ｔ平車(積載10ｔ)"]
[{"$nulls":6},"Ｉｑ支柱３８００","H3800 φ48.6",null,{"v":50,"d":"結束数：50"},"　Iｑシステム","Iq支柱","IQA3800",{"v":11.7,"d":"11.70"},null,null,"4ｔユニック(積載2.4ｔ)",{"$f":"IF(G5=\"\",\"\",COUNTA(G$5:G5))","v":1},{"$f":"IF(I5>0,ROW(),\"\")","v":""}]
[{"$nulls":6},"Ｉｑ支柱１９００【青】","H1900 φ48.6",null,{"v":50,"d":"結束数：50"},"　Iｑシステム","Iq支柱","IQA1900",{"v":6.2,"d":"6.20"},{"$nulls":4},{"$f":"IF(I6>0,ROW(),\"\")","v":""}]
[{"$nulls":6},"Ｉｑ支柱１４２５【黄】","H1425 φ48.6",null,{"v":50,"d":"結束数：50"},"　Iｑシステム","Iq支柱","IQA1425",{"v":4.8,"d":"4.80"},{"$nulls":3},100,""]
[{"$nulls":6},"Ｉｑ支柱９５０【ピンク】","H950 φ48.6",null,{"v":50,"d":"結束数：50"},"　Iｑシステム","Iq支柱","IQA950",{"v":3.4,"d":"3.40"},{"$nulls":3},200,""]
[{"$nulls":6},"Ｉｑ支柱４７５【黄緑】","H475 φ48.6",null,{"v":50,"d":"結束数：50"},"　Iｑシステム","Iq支柱","IQA475",{"v":2.1,"d":"2.10"},{"$nulls":3},300,""]
[{"$nulls":6},"Ｉｑ下部支柱２７５０Ａ　","最下段用 H2750",null,{"v":50,"d":"結束数：50"},"　Iｑシステム","Iq支柱","IQA2750A",{"v":8.8,"d":"8.80"},{"$nulls":3},400,""]
[{"$nulls":6},"Ｉｑ下部支柱１４２５Ａ【スカイブルー】","最下段用 H1425",null,{"v":50,"d":"結束数：50"},"　Iｑシステム","Iq支柱","IQA1425A",{"v":4.9,"d":"4.90"},{"$nulls":3},500,""]
[{"$nulls":6},"Ｉｑ下部支柱９５０Ａ　【オレンジ】","最下段用 H950",null,{"v":50,"d":"結束数：50"},"　Iｑシステム","Iq支柱","IQA950A",{"v":3.4,"d":"3.40"},{"$nulls":3},600,""]
[{"$nulls":6},"Ｉｑ下部支柱４７５Ａ【緑】　","最下段用 H475",null,{"v":50,"d":"結束数：50"},"　Iｑシステム","Iq支柱","IQA475A",{"v":2.1,"d":"2.10"},{"$nulls":3},700,""]
[{"$nulls":6},"Ｉｑ下部支柱２３８Ａ　","最下段用 H238",null,{"v":100,"d":"結束数：100"},"　Iｑシステム","Iq支柱","IQA238A",{"v":1.4,"d":"1.40"},{"$nulls":3},800,""]
[{"$nulls":6},"Ｉｑヘッド支柱９５０【黒】","ステージ用　Ｈ950",null,{"v":50,"d":"結束数：50"},"　Iｑシステム","Iq支柱","IQA950H",{"v":3,"d":"3.00"},{"$nulls":3},900,""]
[{"$nulls":6},"Ｉｑヘッド支柱６００【紫】","支保工用　Ｈ600",null,{"v":50,"d":"結束数：50"},"　Iｑシステム","Iq支柱","IQA600H",{"v":1.8,"d":"1.80"},{"$nulls":3},1000,""]
[{"$nulls":6},"Ｉｑ手すり１８２９","L1829　φ42.7",null,{"v":50,"d":"結束数：50"},"　Iｑシステム","Iq手すり","IQC1829",{"v":4.4,"d":"4.40"},{"$nulls":3},50,""]
[{"$nulls":6},"Ｉｑ手すり１５２４【黄】","L1524　φ42.7",null,{"v":50,"d":"結束数：50"},"　Iｑシステム","Iq手すり","IQC1524",{"v":3.7,"d":"3.70"},{"$nulls":3},100,""]
[{"$nulls":6},"Ｉｑ手すり１２１９【青】","L・W1219　φ42.7",null,{"v":50,"d":"結束数：50"},"　Iｑシステム","Iq手すり","IQC1219",{"v":3,"d":"3.00"},{"$nulls":3},150,""]
[{"$nulls":6},"Ｉｑ手すり１１０７【黄緑】","梁専用 W1107　φ42.7",null,{"v":50,"d":"結束数：50"},"　Iｑシステム","Iq手すり","IQC1107",{"v":2.8,"d":"2.80"},{"$nulls":3},200]
[{"$nulls":6},"Ｉｑ手すり９１４【ピンク】","L・W914　φ42.7",null,{"v":50,"d":"結束数：50"},"　Iｑシステム","Iq手すり","IQC914",{"v":2.3,"d":"2.30"},{"$nulls":3},250]
[{"$nulls":6},"Ｉｑ手すり７２２【ムラサキ】","※コーナー調整専用（1.829-1.107）",null,{"v":50,"d":"結束数：50"},"　Iｑシステム","Iq手すり","IQC722",{"v":2,"d":"2.00"},{"$nulls":3},300]
[{"$nulls":6},"Ｉｑ手すり６１０","L・W610　φ42.7",null,{"v":50,"d":"結束数：50"},"　Iｑシステム","Iq手すり","IQC610",{"v":1.6,"d":"1.60"},{"$nulls":3},350]
[{"$nulls":6},"Ｉｑ手すり３６０【オレンジ】","L360　φ42.7",null,{"v":20,"d":"梱包数：20"},"　Iｑシステム","Iq手すり","IQC360",{"v":1,"d":"1.00"},20,null,null,400]
[{"$nulls":6},"Ｉｑ手すり３０５","L305　φ42.7",null,{"v":20,"d":"梱包数：20"},"　Iｑシステム","Iq手すり","IQC305",{"v":0.9,"d":"0.90"},20,null,null,450]
[{"$nulls":6},"Ｉｑ手すり２５０【黒】","L250　φ42.7",null,{"v":20,"d":"梱包数：20"},"　Iｑシステム","Iq手すり","IQC250",{"v":0.8,"d":"0.80"},20,null,null,500]
[{"$nulls":6},"Ｉｑ【先行】手すり１８２９","L1829　φ27.2",null,{"v":50,"d":"結束数：50"},"　Iｑシステム","Iq先行手すり","IQSCX18",{"v":7.2,"d":"7.20"},{"$nulls":3},200]
[{"$nulls":6},"Ｉｑ【先行】手すり１５２４【黄】","L1524　φ27.2",null,{"v":50,"d":"結束数：50"},"　Iｑシステム","Iq先行手すり","IQSCX15",{"v":6.3,"d":"6.30"},{"$nulls":3},400]
[{"$nulls":6},"Ｉｑ【先行】手すり１２１９【青】","L1219　φ27.2",null,{"v":50,"d":"結束数：50"},"　Iｑシステム","Iq先行手すり","IQSCX12",{"v":5.5,"d":"5.50"},{"$nulls":3},600]
["*印の資材は取寄せ品にて、納期等は確認後にご連絡させて頂きます。",{"$nulls":5},"Ｉｑ【先行】手すり９１４【ピンク】","L914　φ27.2",null,{"v":50,"d":"結束数：50"},"　Iｑシステム","Iq先行手すり","IQSCX09",{"v":4.7,"d":"4.70"},{"$nulls":3},800]
{"$rows_left_out":301}
{"sheet":"発注シート（送付用）","index":1,"n_rows":38,"n_cols":22,"rows_kept":38,"merged":[[0,1,1,12],[0,13,1,17],[2,1,2,17],[3,1,3,3],[3,4,3,9],[3,10,3,12],[3,13,3,16],[3,19,3,22],[4,1,4,3],[4,4,4,9],[4,10,4,12],[4,13,4,17],[4,19,4,22],[5,1,5,3],[5,4,5,9],[5,10,5,12],[5,13,5,17],[5,19,5,22],[6,1,6,3],[6,4,6,9],[6,10,6,12],[6,13,6,17],[6,19,6,20],[7,1,7,3],[7,4,7,11],[7,13,7,14],[7,15,7,16],[7,19,7,22],[8,1,8,3],[8,4,8,9],[8,10,8,17],[8,19,8,22],[9,1,9,17],[10,1,10,17],[11,1,11,17],[12,1,12,17],[13,2,13,6],[13,7,13,8],[13,11,13,15],[13,16,13,17],[14,2,14,6],[14,7,14,8],[14,11,14,15],[14,16,14,17],[15,2,15,6],[15,7,15,8],[15,11,15,15],[15,16,15,17],[16,2,16,6],[16,7,16,8],[16,11,16,15],[16,16,16,17],[17,2,17,6],[17,7,17,8],[17,11,17,15],[17,16,17,17],[18,2,18,6],[18,7,18,8],[18,11,18,15],[18,16,18,17],[19,2,19,6],[19,7,19,8],[19,11,19,15],[19,16,19,17],[20,2,20,6],[20,7,20,8],[20,11,20,15],[20,16,20,17],[21,2,21,6],[21,7,21,8],[21,11,21,15],[21,16,21,17],[22,2,22,6],[22,7,22,8],[22,11,22,15],[22,16,22,17],[23,2,23,6],[23,7,23,8],[23,11,23,15],[23,16,23,17],[24,2,24,6],[24,7,24,8],[24,11,24,15],[24,16,24,17],[25,2,25,6],[25,7,25,8],[25,11,25,15],[25,16,25,17],[26,2,26,6],[26,7,26,8],[26,11,26,15],[26,16,26,17],[27,2,27,6],[27,7,27,8],[27,11,27,15],[27,16,27,17],[28,2,28,6],[28,7,28,8],[28,11,28,15],[28,16,28,17],[29,2,29,6],[29,7,29,8],[29,11,29,15],[29,16,29,17],[30,2,30,6],[30,7,30,8],[30,11,30,15],[30,16,30,17],[31,2,31,6],[31,7,31,8],[31,11,31,15],[31,16,31,17],[32,2,32,6],[32,7,32,8],[32,11,32,15],[32,16,32,17],[33,2,33,6],[33,7,33,8],[33,11,33,15],[33,16,33,17],[34,2,34,6],[34,7,34,8],[34,11,34,15],[34,16,34,17],[35,2,35,6],[35,7,35,8],[35,11,35,15],[35,16,35,17],[36,2,36,6],[36,7,36,8],[36,11,36,15],[36,16,36,17],[37,2,37,6],[37,7,37,8],[37,11,37,15],[37,16,37,17]]}
[null,"青 森 ア ト ム 宛　資 材 発 注 書",{"$nulls":11},{"$f":"NOW()","v":"2025-04-14T10:12:45.750"}]
[]
[null,"下記入力内容をご確認の上、メールかFaxで送付をお願いします。　"]
[null,"会社名",{"$nulls":8},"納入希望日",{"$nulls":6},{"$f":"TEXT(N4,\"（aaa）;；\")","v":""},null,{"$f":"IFERROR(IF(休業日!X5=\"*\",休業日!Y5&休業日!Y6,\"\"),\"\")","v":""}]
[null,"現場名",{"$nulls":8},"納入希望時間\n8:00～16:00",{"$nulls":8},{"$f":"休業日!Y4","v":""}]
[null,"発注者",{"$nulls":8},"納入方法",{"$nulls":8},{"$f":"IF(N6=\"配 達 希 望\",休業日!Y7,\"\")","v":""}]
[null,"連絡先電話",{"$nulls":8},"車　種",{"$nulls":8},{"$f":"IF('発注シート（送付用）'!Q38>30,\"マルチパレットの使用をお勧めします。 概算必要数➡\",\"\")","v":""},null,{"$f":"休業日!W2","v":""}]
[null,"メールでの発注は",null,null,"　order-am-atom@am-atom.jp ",{"$nulls":8},"資材重量",null,{"$f":"休業日!T1","v":{"v":0,"d":"0.0"}},null,"ｔ",null,{"$f":"休業日!X25","v":""}]
[null,"Faxでの発注は",null,null,"　0 1 7 5 - 4 5 - 7 7 5 1",{"$nulls":5},"※資材の嵩により積載重量以下でも全数を積めない場合があります。",{"$nulls":8},{"$f":"休業日!X26","v":0}]
[null,"【注意事項や伝達事項などがございましたらご記入ください。】　例.納入場所、受取者、申請必要…"]
[]
[]
[]
[null,{"$f":"VLOOKUP(1,休業日!$K$2:$N$298,1,FALSE)","v":1},{"$f":"VLOOKUP(B14,休業日!$K$2:$N$999,2,FALSE)","v":""},{"$nulls":4},{"$f":"VLOOKUP(B14,休業日!$K$2:$N$999,4,FALSE)","v":""},null,null,{"$f":"VLOOKUP(26,休業日!$K$2:$N$298,1,FALSE)","v":26},{"$f":"VLOOKUP(K14,休業日!$K$2:$N$999,2,FALSE)","v":""},{"$nulls":4},{"$f":"VLOOKUP(K14,休業日!$K$2:$N$298,4,FALSE)","v":""}]
[null,{"$f":"VLOOKUP(2,休業日!$K$2:$N$298,1,FALSE)","v":2},{"$f":"VLOOKUP(B15,休業日!$K$2:$N$999,2,FALSE)","v":""},{"$nulls":4},{"$f":"VLOOKUP(B15,休業日!$K$2:$N$999,4,FALSE)","v":""},null,null,{"$f":"VLOOKUP(27,休業日!$K$2:$N$298,1,FALSE)","v":27},{"$f":"VLOOKUP(K15,休業日!$K$2:$N$999,2,FALSE)","v":""},{"$nulls":4},{"$f":"VLOOKUP(K15,休業日!$K$2:$N$298,4,FALSE)","v":""}]
[null,{"$f":"VLOOKUP(3,休業日!$K$2:$N$298,1,FALSE)","v":3},{"$f":"VLOOKUP(B16,休業日!$K$2:$N$999,2,FALSE)","v":""},{"$nulls":4},{"$f":"VLOOKUP(B16,休業日!$K$2:$N$999,4,FALSE)","v":""},null,null,{"$f":"VLOOKUP(28,休業日!$K$2:$N$298,1,FALSE)","v":28},{"$f":"VLOOKUP(K16,休業日!$K$2:$N$999,2,FALSE)","v":""},{"$nulls":4},{"$f":"VLOOKUP(K16,休業日!$K$2:$N$298,4,FALSE)","v":""}]
[null,{"$f":"VLOOKUP(4,休業日!$K$2:$N$298,1,FALSE)","v":4},{"$f":"VLOOKUP(B17,休業日!$K$2:$N$999,2,FALSE)","v":""},{"$nulls":4},{"$f":"VLOOKUP(B17,休業日!$K$2:$N$999,4,FALSE)","v":""},null,null,{"$f":"VLOOKUP(29,休業日!$K$2:$N$298,1,FALSE)","v":29},{"$f":"VLOOKUP(K17,休業日!$K$2:$N$999,2,FALSE)","v":""},{"$nulls":4},{"$f":"VLOOKUP(K17,休業日!$K$2:$N$298,4,FALSE)","v":""}]
[null,{"$f":"VLOOKUP(5,休業日!$K$2:$N$298,1,FALSE)","v":5},{"$f":"VLOOKUP(B18,休業日!$K$2:$N$999,2,FALSE)","v":""},{"$nulls":4},{"$f":"VLOOKUP(B18,休業日!$K$2:$N$999,4,FALSE)","v":""},null,null,{"$f":"VLOOKUP(30,休業日!$K$2:$N$298,1,FALSE)","v":30},{"$f":"VLOOKUP(K18,休業日!$K$2:$N$999,2,FALSE)","v":""},{"$nulls":4},{"$f":"VLOOKUP(K18,休業日!$K$2:$N$298,4,FALSE)","v":""}]
[null,{"$f":"VLOOKUP(6,休業日!$K$2:$N$298,1,FALSE)","v":6},{"$f":"VLOOKUP(B19,休業日!$K$2:$N$999,2,FALSE)","v":""},{"$nulls":4},{"$f":"VLOOKUP(B19,休業日!$K$2:$N$999,4,FALSE)","v":""},null,null,{"$f":"VLOOKUP(31,休業日!$K$2:$N$298,1,FALSE)","v":31},{"$f":"VLOOKUP(K19,休業日!$K$2:$N$999,2,FALSE)","v":""},{"$nulls":4},{"$f":"VLOOKUP(K19,休業日!$K$2:$N$298,4,FALSE)","v":""}]
[null,{"$f":"VLOOKUP(7,休業日!$K$2:$N$298,1,FALSE)","v":7},{"$f":"VLOOKUP(B20,休業日!$K$2:$N$999,2,FALSE)","v":""},{"$nulls":4},{"$f":"VLOOKUP(B20,休業日!$K$2:$N$999,4,FALSE)","v":""},null,null,{"$f":"VLOOKUP(32,休業日!$K$2:$N$298,1,FALSE)","v":32},{"$f":"VLOOKUP(K20,休業日!$K$2:$N$999,2,FALSE)","v":""},{"$nulls":4},{"$f":"VLOOKUP(K20,休業日!$K$2:$N$298,4,FALSE)","v":""}]
[null,{"$f":"VLOOKUP(8,休業日!$K$2:$N$298,1,FALSE)","v":8},{"$f":"VLOOKUP(B21,休業日!$K$2:$N$999,2,FALSE)","v":""},{"$nulls":4},{"$f":"VLOOKUP(B21,休業日!$K$2:$N$999,4,FALSE)","v":""},null,null,{"$f":"VLOOKUP(33,休業日!$K$2:$N$298,1,FALSE)","v":33},{"$f":"VLOOKUP(K21,休業日!$K$2:$N$999,2,FALSE)","v":""},{"$nulls":4},{"$f":"VLOOKUP(K21,休業日!$K$2:$N$298,4,FALSE)","v":""}]
[null,{"$f":"VLOOKUP(9,休業日!$K$2:$N$298,1,FALSE)","v":9},{"$f":"VLOOKUP(B22,休業日!$K$2:$N$999,2,FALSE)","v":""},{"$nulls":4},{"$f":"VLOOKUP(B22,休業日!$K$2:$N$999,4,FALSE)","v":""},null,null,{"$f":"VLOOKUP(34,休業日!$K$2:$N$298,1,FALSE)","v":34},{"$f":"VLOOKUP(K22,休業日!$K$2:$N$999,2,FALSE)","v":""},{"$nulls":4},{"$f":"VLOOKUP(K22,休業日!$K$2:$N$298,4,FALSE)","v":""}]
[null,{"$f":"VLOOKUP(10,休業日!$K$2:$N$298,1,FALSE)","v":10},{"$f":"VLOOKUP(B23,休業日!$K$2:$N$999,2,FALSE)","v":""},{"$nulls":4},{"$f":"VLOOKUP(B23,休業日!$K$2:$N$999,4,FALSE)","v":""},null,null,{"$f":"VLOOKUP(35,休業日!$K$2:$N$298,1,FALSE)","v":35},{"$f":"VLOOKUP(K23,休業日!$K$2:$N$999,2,FALSE)","v":""},{"$nulls":4},{"$f":"VLOOKUP(K23,休業日!$K$2:$N$298,4,FALSE)","v":""}]
[null,{"$f":"VLOOKUP(11,休業日!$K$2:$N$298,1,FALSE)","v":11},{"$f":"VLOOKUP(B24,休業日!$K$2:$N$999,2,FALSE)","v":""},{"$nulls":4},{"$f":"VLOOKUP(B24,休業日!$K$2:$N$999,4,FALSE)","v":""},null,null,{"$f":"VLOOKUP(36,休業日!$K$2:$N$298,1,FALSE)","v":36},{"$f":"VLOOKUP(K24,休業日!$K$2:$N$999,2,FALSE)","v":""},{"$nulls":4},{"$f":"VLOOKUP(K24,休業日!$K$2:$N$298,4,FALSE)","v":""}]
[null,{"$f":"VLOOKUP(12,休業日!$K$2:$N$298,1,FALSE)","v":12},{"$f":"VLOOKUP(B25,休業日!$K$2:$N$999,2,FALSE)","v":""},{"$nulls":4},{"$f":"VLOOKUP(B25,休業日!$K$2:$N$999,4,FALSE)","v":""},null,null,{"$f":"VLOOKUP(37,休業日!$K$2:$N$298,1,FALSE)","v":37},{"$f":"VLOOKUP(K25,休業日!$K$2:$N$999,2,FALSE)","v":""},{"$nulls":4},{"$f":"VLOOKUP(K25,休業日!$K$2:$N$298,4,FALSE)","v":""}]
[null,{"$f":"VLOOKUP(13,休業日!$K$2:$N$298,1,FALSE)","v":13},{"$f":"VLOOKUP(B26,休業日!$K$2:$N$999,2,FALSE)","v":""},{"$nulls":4},{"$f":"VLOOKUP(B26,休業日!$K$2:$N$999,4,FALSE)","v":""},null,null,{"$f":"VLOOKUP(38,休業日!$K$2:$N$298,1,FALSE)","v":38},{"$f":"VLOOKUP(K26,休業日!$K$2:$N$999,2,FALSE)","v":""},{"$nulls":4},{"$f":"VLOOKUP(K26,休業日!$K$2:$N$298,4,FALSE)","v":""}]
[null,{"$f":"VLOOKUP(14,休業日!$K$2:$N$298,1,FALSE)","v":14},{"$f":"VLOOKUP(B27,休業日!$K$2:$N$999,2,FALSE)","v":""},{"$nulls":4},{"$f":"VLOOKUP(B27,休業日!$K$2:$N$999,4,FALSE)","v":""},null,null,{"$f":"VLOOKUP(39,休業日!$K$2:$N$298,1,FALSE)","v":39},{"$f":"VLOOKUP(K27,休業日!$K$2:$N$999,2,FALSE)","v":""},{"$nulls":4},{"$f":"VLOOKUP(K27,休業日!$K$2:$N$298,4,FALSE)","v":""}]
[null,{"$f":"VLOOKUP(15,休業日!$K$2:$N$298,1,FALSE)","v":15},{"$f":"VLOOKUP(B28,休業日!$K$2:$N$999,2,FALSE)","v":""},{"$nulls":4},{"$f":"VLOOKUP(B28,休業日!$K$2:$N$999,4,FALSE)","v":""},null,null,{"$f":"VLOOKUP(40,休業日!$K$2:$N$298,1,FALSE)","v":40},{"$f":"VLOOKUP(K28,休業日!$K$2:$N$999,2,FALSE)","v":""},{"$nulls":4},{"$f":"VLOOKUP(K28,休業日!$K$2:$N$298,4,FALSE)","v":""}]
[null,{"$f":"VLOOKUP(16,休業日!$K$2:$N$298,1,FALSE)","v":16},{"$f":"VLOOKUP(B29,休業日!$K$2:$N$999,2,FALSE)","v":""},{"$nulls":4},{"$f":"VLOOKUP(B29,休業日!$K$2:$N$999,4,FALSE)","v":""},null,null,{"$f":"VLOOKUP(41,休業日!$K$2:$N$298,1,FALSE)","v":41},{"$f":"VLOOKUP(K29,休業日!$K$2:$N$999,2,FALSE)","v":""},{"$nulls":4},{"$f":"VLOOKUP(K29,休業日!$K$2:$N$298,4,FALSE)","v":""}]
[null,{"$f":"VLOOKUP(17,休業日!$K$2:$N$298,1,FALSE)","v":17},{"$f":"VLOOKUP(B30,休業日!$K$2:$N$999,2,FALSE)","v":""},{"$nulls":4},{"$f":"VLOOKUP(B30,休業日!$K$2:$N$999,4,FALSE)","v":""},null,null,{"$f":"VLOOKUP(42,休業日!$K$2:$N$298,1,FALSE)","v":42},{"$f":"VLOOKUP(K30,休業日!$K$2:$N$999,2,FALSE)","v":""},{"$nulls":4},{"$f":"VLOOKUP(K30,休業日!$K$2:$N$298,4,FALSE)","v":""}]
{"$rows_left_out":9}
{"sheet":"休業日","index":2,"n_rows":397,"n_cols":30,"rows_kept":397}
[null,null,"機材名","備考","注文数","品　目","分類","コード","重量","土のう袋",{"$nulls":5},{"$f":"IF(Q1=\"\",\"\",1)","v":""},{"$f":"IF(F1=\"*\",H1,\"\")","v":""},{"$f":"IF(F1=\"*\",I1,\"\")","v":""},{"$f":"IF(F1=\"*\",J1,0)","v":{"v":0,"d":"0 "}},{"$f":"SUM(T2:T584)*0.001","v":{"v":0,"d":"0.0"}},{"$f":"IF(G1=\"*\",K1,0)","v":{"v":0,"d":"0 "}},{"$f":"SUM(V2:V228)","v":{"v":0,"d":"0 "}},{"$f":"ROUNDUP(V1/30,0)","v":0},{"$f":"TEXT(X3,\"aaa\")","v":"土"},{"$nulls":3},"青森アトム　休業日"]
[{"$f":"IF(B2=\"\",\"\",(COUNTIF($B$2:B2,B2)))","v":""},{"$f":"IF(E2,\"1\",\"\")","v":""},"Ｉｑ支柱３８００","H3800 φ48.6",{"$f":"入力!I5","v":0},"　Iｑシステム","Iq支柱","IQA3800",{"v":11.7,"d":"11.70"},null,1,{"$f":"IFERROR(VLOOKUP(K2,$A$2:$E$999,3,FALSE),\"\")","v":""},{"$f":"IFERROR(VLOOKUP(K2,$A$2:$E$99,4,FALSE),\"\")","v":""},{"$f":"IFERROR(VLOOKUP(K2,$A$2:$E$499,5,FALSE),\"\")","v":""},null,{"$f":"IF(E2=\"0\",\"\",H2)","v":"IQA3800"},{"$f":"IF(E2=\"0\",\"\",C2)","v":"Ｉｑ支柱３８００"},{"$f":"IF(E2=\"\",\"\",E2)","v":{"v":0,"d":"0 "}},{"$f":"IF(E2=\"\",0,I2)","v":{"v":11.7,"d":"12 "}},{"$f":"R2*S2","v":{"v":0,"d":"0 "}},{"$f":"IF(E2=\"0\",\"\",J2)","v":{"v":0,"d":"0 "}},null,{"$f":"IF(W1=0,\"\",W1)","v":""},{"$f":"'発注シート（送付用）'!N1","v":"2025-04-14T10:12:45.750"},null,{"$f":"AB2","v":45748},{"$f":"IF(AD2=\"\",\"\",\"*\")","v":""},"2025-04-01",{"$f":"TEXT(AB2,\"aaa\")","v":"火"}]
[{"$f":"IF(B3=\"\",\"\",(COUNTIF($B$2:B3,B3)))","v":""},{"$f":"IF(E3,\"1\",\"\")","v":""},"Ｉｑ支柱１９００【青】","H1900 φ48.6",{"$f":"入力!I6","v":0},"　Iｑシステム","Iq支柱","IQA1900",{"v":6.2,"d":"6.20"},null,2,"","","",null,{"$f":"IF(E3=\"0\",\"\",H3)","v":"IQA1900"},"Ｉｑ支柱１９００【青】",{"$f":"IF(E3=\"\",\"\",E3)","v":{"v":0,"d":"0 "}},{"$f":"IF(E3=\"\",0,I3)","v":{"v":6.2,"d":"6 "}},{"$f":"R3*S3","v":{"v":0,"d":"0 "}},{"v":0,"d":"0 "},null,null,{"$f":"'発注シート（送付用）'!N4+'発注シート（送付用）'!N5","v":"00:00:00"},{"$f":"IFERROR(VLOOKUP(Z1,Z1:AD500,5,FALSE),0)","v":0},{"$f":"AB3","v":45749},{"$f":"IF(AD3=\"\",\"\",\"*\")","v":""},{"$f":"AB2+1","v":"2025-04-02"},"水"]
[{"$f":"IF(B4=\"\",\"\",(COUNTIF($B$2:B4,B4)))","v":""},"","Ｉｑ支柱１４２５【黄】","H1425 φ48.6",{"$f":"入力!I7","v":0},"　Iｑシステム","Iq支柱","IQA1425",{"v":4.8,"d":"4.80"},null,3,"","","",null,"IQA1425","Ｉｑ支柱１４２５【黄】",{"v":0,"d":"0 "},{"v":4.8,"d":"5 "},{"v":0,"d":"0 "},{"v":0,"d":"0 "},null,null,{"$f":"IF(X3-X2<0,\"\",X3-X2)","v":""},{"$f":"IF(X4<1,\"午前お引取りの発注は前日の午前中までに、午後お引取りの発注は前日の営業時間内に、ご協力をお願いします。\",\"\")","v":""},45750,"",{"$f":"AB3+1","v":"2025-04-03"},"木"]
[{"$f":"IF(B5=\"\",\"\",(COUNTIF($B$2:B5,B5)))","v":""},"","Ｉｑ支柱９５０【ピンク】","H950 φ48.6",{"$f":"入力!I8","v":0},"　Iｑシステム","Iq支柱","IQA950",{"v":3.4,"d":"3.40"},null,4,"","","",null,"IQA950","Ｉｑ支柱９５０【ピンク】",{"v":0,"d":"0 "},{"v":3.4,"d":"3 "},{"v":0,"d":"0 "},{"v":0,"d":"0 "},null,null,{"$f":"VLOOKUP('発注シート（送付用）'!N4,Z2:AA366,2,TRUE)","v":{"$error":"#N/A"}},{"$f":"IFERROR(VLOOKUP(X3,AB2:AD366,3,TRUE),\"\")","v":""},45751,"","2025-04-04","金"]
[{"$f":"IF(B6=\"\",\"\",(COUNTIF($B$2:B6,B6)))","v":""},"","Ｉｑ支柱４７５【黄緑】","H475 φ48.6",{"$f":"入力!I9","v":0},"　Iｑシステム","Iq支柱","IQA475",{"v":2.1,"d":"2.10"},null,5,"","","",null,"IQA475","Ｉｑ支柱４７５【黄緑】",{"v":0,"d":"0 "},{"v":2.1,"d":"2 "},{"v":0,"d":"0 "},{"v":0,"d":"0 "},{"$nulls":3},"ですので、ご注意願います。",45752,"*","2025-04-05","土","休業日"]
[{"$f":"IF(B7=\"\",\"\",(COUNTIF($B$2:B7,B7)))","v":""},"","Ｉｑ下部支柱２７５０Ａ　","最下段用 H2750",{"$f":"入力!I10","v":0},"　Iｑシステム","Iq支柱","IQA2750A",{"v":8.8,"d":"8.80"},null,6,"","","",null,"IQA2750A","Ｉｑ下部支柱２７５０Ａ　",{"v":0,"d":"0 "},{"v":8.8,"d":"9 "},{"v":0,"d":"0 "},{"v":0,"d":"0 "},null,null,{"$f":"IF('発注シート（送付用）'!N6=\"配 達 希 望\",1,0)","v":{"v":0,"d":"0 "}},{"$f":"IF(X4+X7<2,\"車両手配（配達希望）の場合は、営業日2日前までにご依頼をお願いします。\",\"\")","v":{"$error":"#VALUE!"}},45753,"*","2025-04-06","日","休業日"]
[{"$f":"IF(B8=\"\",\"\",(COUNTIF($B$2:B8,B8)))","v":""},"","Ｉｑ下部支柱１４２５Ａ【スカイブルー】","最下段用 H1425",{"$f":"入力!I11","v":0},"　Iｑシステム","Iq支柱","IQA1425A",{"v":4.9,"d":"4.90"},null,7,"","","",null,"IQA1425A","Ｉｑ下部支柱１４２５Ａ【スカイブルー】",{"v":0,"d":"0 "},{"v":4.9,"d":"5 "},{"v":0,"d":"0 "},{"v":0,"d":"0 "},null,null,{"$f":"'発注シート（送付用）'!N7","v":0},{"$f":"IF(T1>X12,\"積載重量超過！　発注数量の調整をお願いします。\",\"\")","v":""},45754,"","2025-04-07","月"]
[{"$f":"IF(B9=\"\",\"\",(COUNTIF($B$2:B9,B9)))","v":""},"","Ｉｑ下部支柱９５０Ａ　【オレンジ】","最下段用 H950",{"$f":"入力!I12","v":0},"　Iｑシステム","Iq支柱","IQA950A",{"v":3.4,"d":"3.40"},null,8,"","","",null,"IQA950A","Ｉｑ下部支柱９５０Ａ　【オレンジ】",{"v":0,"d":"0 "},{"v":3.4,"d":"3 "},{"v":0,"d":"0 "},{"v":0,"d":"0 "},null,null,2.4,null,45755,"","2025-04-08","火"]
[{"$f":"IF(B10=\"\",\"\",(COUNTIF($B$2:B10,B10)))","v":""},"","Ｉｑ下部支柱４７５Ａ【緑】　","最下段用 H475",{"$f":"入力!I13","v":0},"　Iｑシステム","Iq支柱","IQA475A",{"v":2.1,"d":"2.10"},null,9,"","","",null,"IQA475A","Ｉｑ下部支柱４７５Ａ【緑】　",{"v":0,"d":"0 "},{"v":2.1,"d":"2 "},{"v":0,"d":"0 "},{"v":0,"d":"0 "},null,null,9,null,45756,"","2025-04-09","水"]
[{"$f":"IF(B11=\"\",\"\",(COUNTIF($B$2:B11,B11)))","v":""},"","Ｉｑ下部支柱２３８Ａ　","最下段用 H238",{"$f":"入力!I14","v":0},"　Iｑシステム","Iq支柱","IQA238A",{"v":1.4,"d":"1.40"},null,10,"","","",null,"IQA238A","Ｉｑ下部支柱２３８Ａ　",{"v":0,"d":"0 "},{"v":1.4,"d":"1 "},{"v":0,"d":"0 "},{"v":0,"d":"0 "},null,null,10,null,45757,"","2025-04-10","木"]
[{"$f":"IF(B12=\"\",\"\",(COUNTIF($B$2:B12,B12)))","v":""},"","Ｉｑヘッド支柱９５０【黒】","ステージ用　Ｈ950",{"$f":"入力!I15","v":0},"　Iｑシステム","Iq支柱","IQA950H",{"v":3,"d":"3.00"},null,11,"","","",null,"IQA950H","Ｉｑヘッド支柱９５０【黒】",{"v":0,"d":"0 "},{"v":3,"d":"3 "},{"v":0,"d":"0 "},{"v":0,"d":"0 "},null,null,{"$f":"IF(X8=\"増ｔユニック(積載9ｔ)\",9,IF(X8=\"増ｔ平車(積載10ｔ)\",10,2.4))","v":2.4},null,45758,"","2025-04-11","金"]
[{"$f":"IF(B13=\"\",\"\",(COUNTIF($B$2:B13,B13)))","v":""},"","Ｉｑヘッド支柱６００【紫】","支保工用　Ｈ600",{"$f":"入力!I16","v":0},"　Iｑシステム","Iq支柱","IQA600H",{"v":1.8,"d":"1.80"},null,12,"","","",null,"IQA600H","Ｉｑヘッド支柱６００【紫】",{"v":0,"d":"0 "},{"v":1.8,"d":"2 "},{"v":0,"d":"0 "},{"v":0,"d":"0 "},{"$nulls":4},45759,"*","2025-04-12","土","休業日"]
[{"$f":"IF(B14=\"\",\"\",(COUNTIF($B$2:B14,B14)))","v":""},"","Ｉｑ手すり１８２９","L1829　φ42.7",{"$f":"入力!I17","v":0},"　Iｑシステム","Iq手すり","IQC1829",{"v":4.4,"d":"4.40"},null,13,"","","",null,"IQC1829","Ｉｑ手すり１８２９",{"v":0,"d":"0 "},{"v":4.4,"d":"4 "},{"v":0,"d":"0 "},{"v":0,"d":"0 "},null,null,{"$f":"VLOOKUP(X3,AB2:AD366,3,TRUE)","v":{"$error":"#N/A"}},null,45760,"*","2025-04-13","日","休業日"]
[{"$f":"IF(B15=\"\",\"\",(COUNTIF($B$2:B15,B15)))","v":""},"","Ｉｑ手すり１５２４【黄】","L1524　φ42.7",{"$f":"入力!I18","v":0},"　Iｑシステム","Iq手すり","IQC1524",{"v":3.7,"d":"3.70"},null,14,"","","",null,"IQC1524","Ｉｑ手すり１５２４【黄】",{"v":0,"d":"0 "},{"v":3.7,"d":"4 "},{"v":0,"d":"0 "},{"v":0,"d":"0 "},{"$nulls":4},45761,"","2025-04-14","月"]
[{"$f":"IF(B16=\"\",\"\",(COUNTIF($B$2:B16,B16)))","v":""},"","Ｉｑ手すり１２１９【青】","L・W1219　φ42.7",{"$f":"入力!I19","v":0},"　Iｑシステム","Iq手すり","IQC1219",{"v":3,"d":"3.00"},null,15,"","","",null,"IQC1219","Ｉｑ手すり１２１９【青】",{"v":0,"d":"0 "},{"v":3,"d":"3 "},{"v":0,"d":"0 "},{"v":0,"d":"0 "},{"$nulls":4},45762,"","2025-04-15","火"]
[{"$f":"IF(B17=\"\",\"\",(COUNTIF($B$2:B17,B17)))","v":""},"","Ｉｑ手すり１１０７【黄緑】","梁専用 W1107　φ42.7",{"$f":"入力!I20","v":0},"　Iｑシステム","Iq手すり","IQC1107",{"v":2.8,"d":"2.80"},null,16,"","","",null,"IQC1107","Ｉｑ手すり１１０７【黄緑】",{"v":0,"d":"0 "},{"v":2.8,"d":"3 "},{"v":0,"d":"0 "},{"v":0,"d":"0 "},{"$nulls":4},45763,"","2025-04-16","水"]
[{"$f":"IF(B18=\"\",\"\",(COUNTIF($B$2:B18,B18)))","v":""},"","Ｉｑ手すり９１４【ピンク】","L・W914　φ42.7",{"$f":"入力!I21","v":0},"　Iｑシステム","Iq手すり","IQC914",{"v":2.3,"d":"2.30"},null,17,"","","",null,"IQC914","Ｉｑ手すり９１４【ピンク】",{"v":0,"d":"0 "},{"v":2.3,"d":"2 "},{"v":0,"d":"0 "},{"v":0,"d":"0 "},{"$nulls":4},45764,"","2025-04-17","木"]
[{"$f":"IF(B19=\"\",\"\",(COUNTIF($B$2:B19,B19)))","v":""},"","Ｉｑ手すり７２２【ムラサキ】","※コーナー調整専用（1.829-1.107）",{"$f":"入力!I22","v":0},"　Iｑシステム","Iq手すり","IQC722",{"v":2,"d":"2.00"},null,18,"","","",null,"IQC722","Ｉｑ手すり７２２【ムラサキ】",{"v":0,"d":"0 "},{"v":2,"d":"2 "},{"v":0,"d":"0 "},{"v":0,"d":"0 "},{"$nulls":4},45765,"","2025-04-18","金"]
[{"$f":"IF(B20=\"\",\"\",(COUNTIF($B$2:B20,B20)))","v":""},"","Ｉｑ手すり６１０","L・W610　φ42.7",{"$f":"入力!I23","v":0},"　Iｑシステム","Iq手すり","IQC610",{"v":1.6,"d":"1.60"},null,19,"","","",null,"IQC610","Ｉｑ手すり６１０",{"v":0,"d":"0 "},{"v":1.6,"d":"2 "},{"v":0,"d":"0 "},{"v":0,"d":"0 "},{"$nulls":4},45766,"*","2025-04-19","土","休業日"]
[{"$f":"IF(B21=\"\",\"\",(COUNTIF($B$2:B21,B21)))","v":""},"","Ｉｑ手すり３６０【オレンジ】","L360　φ42.7",{"$f":"入力!I24","v":0},"　Iｑシステム","Iq手すり","IQC360",{"v":1,"d":"1.00"},20,20,"","","",null,"IQC360","Ｉｑ手すり３６０【オレンジ】",{"v":0,"d":"0 "},{"v":1,"d":"1 "},{"v":0,"d":"0 "},{"v":20,"d":"20 "},{"$f":"ROUNDDOWN(R21/U21,0)","v":{"v":0,"d":"0 "}},{"$nulls":3},45767,"*","2025-04-20","日","休業日"]
[{"$f":"IF(B22=\"\",\"\",(COUNTIF($B$2:B22,B22)))","v":""},"","Ｉｑ手すり３０５","L305　φ42.7",{"$f":"入力!I25","v":0},"　Iｑシステム","Iq手すり","IQC305",{"v":0.9,"d":"0.90"},20,21,"","","",null,"IQC305","Ｉｑ手すり３０５",{"v":0,"d":"0 "},{"v":0.9,"d":"1 "},{"v":0,"d":"0 "},{"v":20,"d":"20 "},{"v":0,"d":"0 "},{"$nulls":3},45768,"","2025-04-21","月"]
[{"$f":"IF(B23=\"\",\"\",(COUNTIF($B$2:B23,B23)))","v":""},"","Ｉｑ手すり２５０【黒】","L250　φ42.7",{"$f":"入力!I26","v":0},"　Iｑシステム","Iq手すり","IQC250",{"v":0.8,"d":"0.80"},20,22,"","","",null,"IQC250","Ｉｑ手すり２５０【黒】",{"v":0,"d":"0 "},{"v":0.8,"d":"1 "},{"v":0,"d":"0 "},{"v":20,"d":"20 "},{"$f":"ROUNDDOWN(R23/U23,0)","v":{"v":0,"d":"0 "}},{"$nulls":3},45769,"","2025-04-22","火"]
[{"$f":"IF(B24=\"\",\"\",(COUNTIF($B$2:B24,B24)))","v":""},"","Ｉｑ【先行】手すり１８２９","L1829　φ27.2",{"$f":"入力!I27","v":0},"　Iｑシステム","Iq先行手すり","IQSCX18",{"v":7.2,"d":"7.20"},null,23,"","","",null,"IQSCX18","Ｉｑ【先行】手すり１８２９",{"v":0,"d":"0 "},{"v":7.2,"d":"7 "},{"v":0,"d":"0 "},{"v":0,"d":"0 "},{"$nulls":4},45770,"","2025-04-23","水"]
[{"$f":"IF(B25=\"\",\"\",(COUNTIF($B$2:B25,B25)))","v":""},"","Ｉｑ【先行】手すり１５２４【黄】","L1524　φ27.2",{"$f":"入力!I28","v":0},"　Iｑシステム","Iq先行手すり","IQSCX15",{"v":6.3,"d":"6.30"},null,24,"","","",null,"IQSCX15","Ｉｑ【先行】手すり１５２４【黄】",{"v":0,"d":"0 "},{"v":6.3,"d":"6 "},{"v":0,"d":"0 "},{"v":0,"d":"0 "},{"$f":"T25*U25","v":{"v":0,"d":"0 "}},null,{"$f":"IF(T1>X12,\"積載重量超過！　発注数量の調整をお願いします。\",\"\")","v":""},null,45771,"","2025-04-24","木"]
[{"$f":"IF(B26=\"\",\"\",(COUNTIF($B$2:B26,B26)))","v":""},"","Ｉｑ【先行】手すり１２１９【青】","L1219　φ27.2",{"$f":"入力!I29","v":0},"　Iｑシステム","Iq先行手すり","IQSCX12",{"v":5.5,"d":"5.50"},null,25,"","","",null,"IQSCX12","Ｉｑ【先行】手すり１２１９【青】",{"v":0,"d":"0 "},{"v":5.5,"d":"6 "},{"v":0,"d":"0 "},{"v":0,"d":"0 "},{"v":0,"d":"0 "},{"$nulls":3},45772,"","2025-04-25","金"]
[{"$f":"IF(B27=\"\",\"\",(COUNTIF($B$2:B27,B27)))","v":""},"","Ｉｑ【先行】手すり９１４【ピンク】","L914　φ27.2",{"$f":"入力!I30","v":0},"　Iｑシステム","Iq先行手すり","IQSCX09",{"v":4.7,"d":"4.70"},null,26,"","","",null,"IQSCX09","Ｉｑ【先行】手すり９１４【ピンク】",{"v":0,"d":"0 "},{"v":4.7,"d":"5 "},{"v":0,"d":"0 "},{"v":0,"d":"0 "},{"v":0,"d":"0 "},{"$nulls":3},45773,"*","2025-04-26","土","休業日"]
[{"$f":"IF(B28=\"\",\"\",(COUNTIF($B$2:B28,B28)))","v":""},"","Ｉｑ【先行】手すり６１０【黄緑】","L610　φ27.2",{"$f":"入力!I31","v":0},"　Iｑシステム","Iq先行手すり","IQSCX06",{"v":4,"d":"4.00"},null,27,"","","",null,"IQSCX06","Ｉｑ【先行】手すり６１０【黄緑】",{"v":0,"d":"0 "},{"v":4,"d":"4 "},{"v":0,"d":"0 "},{"v":0,"d":"0 "},{"v":0,"d":"0 "},{"$nulls":3},45774,"*","2025-04-27","日","休業日"]
[{"$f":"IF(B29=\"\",\"\",(COUNTIF($B$2:B29,B29)))","v":""},"","Ｉｑアルミカイダン１９","7段　W481　L2471",{"$f":"入力!I32","v":0},"　Iｑシステム","Iqカイダン類","IQKD19",{"v":13.5,"d":"13.50"},null,28,"","","",null,"IQKD19","Ｉｑアルミカイダン１９",{"v":0,"d":"0 "},{"v":13.5,"d":"14 "},{"v":0,"d":"0 "},{"v":0,"d":"0 "},{"v":0,"d":"0 "},{"$nulls":3},45775,"*","2025-04-28","月","GW休業日"]
[{"$f":"IF(B30=\"\",\"\",(COUNTIF($B$2:B30,B30)))","v":""},"","Ｉｑカイダンレール　斜め手すり ","2段目以上用　(1ヵ所あたり2本使用）L2445　",{"$f":"入力!I33","v":0},"　Iｑシステム","Iqカイダン類","IQKDR",{"v":3.6,"d":"3.60"},null,29,"","","",null,"IQKDR","Ｉｑカイダンレール　斜め手すり ",{"v":0,"d":"0 "},{"v":3.6,"d":"4 "},{"v":0,"d":"0 "},{"v":0,"d":"0 "},{"v":0,"d":"0 "},{"$nulls":3},45776,"*","2025-04-29","火","GW休業日"]
{"$rows_left_out":367}